{"text_format":"1","workbook":"xlsx","n_sheets":8,"sheets":["Portada","Energia","Potencia","Factor de carga","Demanda Interruptible","Importacion Contratada","DATOS","DATOS P"],"not_rendered":{"charts":0,"images":1,"macros":1,"external_links":0,"defined_names":4,"comments":0,"pivot_tables":0},"unopened":[],"bounds":{"document_bytes":16777216,"sheet_cells":100000,"rows_first":2000,"rows_last":500,"rows_between":2000,"halvings":0,"cell_chars":16384,"cell_head_chars":4096},"cells_cut":0,"cells_raw":0,"read":"whole","date_system":"1900"}

{"sheet":"Portada","index":0,"n_rows":12,"n_cols":6,"rows_kept":12,"cut":false,"hidden":false,"merged":[[1,14,1,18],[2,14,2,18],[20,3,20,7],[6,1,6,10],[7,1,7,10],[10,1,10,2],[11,1,11,2]]}
[]
[]
[]
[]
[]
[]
[null,"DATOS PARA EL INFORME INDICATIVO DE DEMANDA"]
[null,"PROYECCIONES  - DATOS"]
[]
[]
[null,"RESPONSABLE:"]
[null,"PERIODO:",null,2026,"   ---",{"$f":"+D12+20","v":2046}]

{"sheet":"Energia","index":1,"n_rows":258,"n_cols":2,"rows_kept":258,"cut":false,"hidden":true,"merged":[[3,0,3,1],[2,0,2,1],[1,0,1,1],[0,0,0,1]]}
["REPRESENTANTE"]
["GRAN CLIENTE"]
["DISTRIBUIDOR"]
["CODIGO"]
[]
["AÑO","MES"]
[{"$f":"+Portada!D12","v":2026},1]
[{"$f":"+IF(B8=1,A7+1,A7)","v":2026},{"$f":"+IF(B7=12,1,B7+1)","v":2}]
[{"$f":"+IF(B9=1,A8+1,A8)","v":2026},{"$f":"+IF(B8=12,1,B8+1)","v":3}]
[2026,4]
[2026,5]
[2026,6]
[2026,7]
[2026,8]
[2026,9]
[2026,10]
[2026,11]
[2026,12]
[2027,1]
[2027,2]
[2027,3]
[2027,4]
[2027,5]
[2027,6]
[2027,7]
[2027,8]
[2027,9]
[2027,10]
[2027,11]
[2027,12]
[2028,1]
[2028,2]
[2028,3]
[2028,4]
[2028,5]
[2028,6]
[2028,7]
[2028,8]
[2028,9]
[2028,10]
[2028,11]
[2028,12]
[2029,1]
[2029,2]
[2029,3]
[2029,4]
[2029,5]
[2029,6]
[2029,7]
[2029,8]
[2029,9]
[2029,10]
[2029,11]
[2029,12]
[2030,1]
[2030,2]
[2030,3]
[2030,4]
[2030,5]
[2030,6]
[2030,7]
[2030,8]
[2030,9]
[2030,10]
[2030,11]
[2030,12]
[2031,1]
[2031,2]
[2031,3]
[2031,4]
[2031,5]
[2031,6]
[{"$f":"+IF(B73=1,A72+1,A72)","v":2031},{"$f":"+IF(B72=12,1,B72+1)","v":7}]
[2031,8]
[2031,9]
[2031,10]
[2031,11]
[2031,12]
[2032,1]
[2032,2]
[2032,3]
[2032,4]
[2032,5]
[2032,6]
[2032,7]
[2032,8]
[2032,9]
[2032,10]
[2032,11]
[2032,12]
[2033,1]
[2033,2]
[2033,3]
[2033,4]
[2033,5]
[2033,6]
[2033,7]
[2033,8]
[2033,9]
[2033,10]
[2033,11]
[2033,12]
[2034,1]
[2034,2]
[2034,3]
[2034,4]
[2034,5]
[2034,6]
[2034,7]
[2034,8]
[2034,9]
[2034,10]
[2034,11]
[2034,12]
[2035,1]
[2035,2]
[2035,3]
[2035,4]
[2035,5]
[2035,6]
[2035,7]
[2035,8]
[2035,9]
[2035,10]
[2035,11]
[2035,12]
[2036,1]
[2036,2]
[2036,3]
[2036,4]
[2036,5]
[2036,6]
[2036,7]
[2036,8]
[2036,9]
[2036,10]
[{"$f":"+IF(B137=1,A136+1,A136)","v":2036},{"$f":"+IF(B136=12,1,B136+1)","v":11}]
[2036,12]
[2037,1]
[2037,2]
[2037,3]
[2037,4]
[2037,5]
[2037,6]
[2037,7]
[2037,8]
[2037,9]
[2037,10]
[2037,11]
[2037,12]
[2038,1]
[2038,2]
[2038,3]
[2038,4]
[2038,5]
[2038,6]
[2038,7]
[2038,8]
[2038,9]
[2038,10]
[2038,11]
[2038,12]
[2039,1]
[2039,2]
[2039,3]
[2039,4]
[2039,5]
[2039,6]
[2039,7]
[2039,8]
[2039,9]
[2039,10]
[2039,11]
[2039,12]
[2040,1]
[2040,2]
[2040,3]
[2040,4]
[2040,5]
[2040,6]
[2040,7]
[2040,8]
[2040,9]
[2040,10]
[2040,11]
[2040,12]
[2041,1]
[2041,2]
[2041,3]
[2041,4]
[2041,5]
[2041,6]
[2041,7]
[2041,8]
[2041,9]
[2041,10]
[2041,11]
[2041,12]
[2042,1]
[2042,2]
[{"$f":"+IF(B201=1,A200+1,A200)","v":2042},{"$f":"+IF(B200=12,1,B200+1)","v":3}]
[2042,4]
[2042,5]
[2042,6]
[2042,7]
[2042,8]
[2042,9]
[2042,10]
[2042,11]
[2042,12]
[2043,1]
[2043,2]
[2043,3]
[2043,4]
[2043,5]
[2043,6]
[2043,7]
[2043,8]
[2043,9]
[2043,10]
[2043,11]
[2043,12]
[2044,1]
[2044,2]
[2044,3]
[2044,4]
[2044,5]
[2044,6]
[2044,7]
[2044,8]
[2044,9]
[2044,10]
[2044,11]
[2044,12]
[2045,1]
[2045,2]
[2045,3]
[2045,4]
[2045,5]
[2045,6]
[2045,7]
[2045,8]
[2045,9]
[2045,10]
[2045,11]
[2045,12]
[2046,1]
[2046,2]
[2046,3]
[2046,4]
[2046,5]
[2046,6]
[2046,7]
[2046,8]
[2046,9]
[2046,10]
[2046,11]
[2046,12]

{"sheet":"Potencia","index":2,"n_rows":258,"n_cols":2,"rows_kept":258,"cut":false,"hidden":true,"merged":[[3,0,3,1],[0,0,0,1],[1,0,1,1],[2,0,2,1]]}
["REPRESENTANTE"]
["GRAN CLIENTE"]
["DISTRIBUIDOR"]
["CODIGO"]
[]
["AÑO","MES"]
[{"$f":"+Portada!D12","v":2026},1]
[{"$f":"+IF(B8=1,A7+1,A7)","v":2026},{"$f":"+IF(B7=12,1,B7+1)","v":2}]
[{"$f":"+IF(B9=1,A8+1,A8)","v":2026},{"$f":"+IF(B8=12,1,B8+1)","v":3}]
[2026,4]
[2026,5]
[2026,6]
[2026,7]
[2026,8]
[2026,9]
[2026,10]
[2026,11]
[2026,12]
[2027,1]
[2027,2]
[2027,3]
[2027,4]
[2027,5]
[2027,6]
[2027,7]
[2027,8]
[2027,9]
[2027,10]
[2027,11]
[2027,12]
[2028,1]
[2028,2]
[2028,3]
[2028,4]
[2028,5]
[2028,6]
[2028,7]
[2028,8]
[2028,9]
[2028,10]
[2028,11]
[2028,12]
[2029,1]
[2029,2]
[2029,3]
[2029,4]
[2029,5]
[2029,6]
[2029,7]
[2029,8]
[2029,9]
[2029,10]
[2029,11]
[2029,12]
[2030,1]
[2030,2]
[2030,3]
[2030,4]
[2030,5]
[2030,6]
[2030,7]
[2030,8]
[2030,9]
[2030,10]
[2030,11]
[2030,12]
[2031,1]
[2031,2]
[2031,3]
[2031,4]
[2031,5]
[2031,6]
[{"$f":"+IF(B73=1,A72+1,A72)","v":2031},{"$f":"+IF(B72=12,1,B72+1)","v":7}]
[2031,8]
[2031,9]
[2031,10]
[2031,11]
[2031,12]
[2032,1]
[2032,2]
[2032,3]
[2032,4]
[2032,5]
[2032,6]
[2032,7]
[2032,8]
[2032,9]
[2032,10]
[2032,11]
[2032,12]
[2033,1]
[2033,2]
[2033,3]
[2033,4]
[2033,5]
[2033,6]
[2033,7]
[2033,8]
[2033,9]
[2033,10]
[2033,11]
[2033,12]
[2034,1]
[2034,2]
[2034,3]
[2034,4]
[2034,5]
[2034,6]
[2034,7]
[2034,8]
[2034,9]
[2034,10]
[2034,11]
[2034,12]
[2035,1]
[2035,2]
[2035,3]
[2035,4]
[2035,5]
[2035,6]
[2035,7]
[2035,8]
[2035,9]
[2035,10]
[2035,11]
[2035,12]
[2036,1]
[2036,2]
[2036,3]
[2036,4]
[2036,5]
[2036,6]
[2036,7]
[2036,8]
[2036,9]
[2036,10]
[{"$f":"+IF(B137=1,A136+1,A136)","v":2036},{"$f":"+IF(B136=12,1,B136+1)","v":11}]
[2036,12]
[2037,1]
[2037,2]
[2037,3]
[2037,4]
[2037,5]
[2037,6]
[2037,7]
[2037,8]
[2037,9]
[2037,10]
[2037,11]
[2037,12]
[2038,1]
[2038,2]
[2038,3]
[2038,4]
[2038,5]
[2038,6]
[2038,7]
[2038,8]
[2038,9]
[2038,10]
[2038,11]
[2038,12]
[2039,1]
[2039,2]
[2039,3]
[2039,4]
[2039,5]
[2039,6]
[2039,7]
[2039,8]
[2039,9]
[2039,10]
[2039,11]
[2039,12]
[2040,1]
[2040,2]
[2040,3]
[2040,4]
[2040,5]
[2040,6]
[2040,7]
[2040,8]
[2040,9]
[2040,10]
[2040,11]
[2040,12]
[2041,1]
[2041,2]
[2041,3]
[2041,4]
[2041,5]
[2041,6]
[2041,7]
[2041,8]
[2041,9]
[2041,10]
[2041,11]
[2041,12]
[2042,1]
[2042,2]
[{"$f":"+IF(B201=1,A200+1,A200)","v":2042},{"$f":"+IF(B200=12,1,B200+1)","v":3}]
[2042,4]
[2042,5]
[2042,6]
[2042,7]
[2042,8]
[2042,9]
[2042,10]
[2042,11]
[2042,12]
[2043,1]
[2043,2]
[2043,3]
[2043,4]
[2043,5]
[2043,6]
[2043,7]
[2043,8]
[2043,9]
[2043,10]
[2043,11]
[2043,12]
[2044,1]
[2044,2]
[2044,3]
[2044,4]
[2044,5]
[2044,6]
[2044,7]
[2044,8]
[2044,9]
[2044,10]
[2044,11]
[2044,12]
[2045,1]
[2045,2]
[2045,3]
[2045,4]
[2045,5]
[2045,6]
[2045,7]
[2045,8]
[2045,9]
[2045,10]
[2045,11]
[2045,12]
[2046,1]
[2046,2]
[2046,3]
[2046,4]
[2046,5]
[2046,6]
[2046,7]
[2046,8]
[2046,9]
[2046,10]
[2046,11]
[2046,12]

{"sheet":"Factor de carga","index":3,"n_rows":258,"n_cols":2,"rows_kept":258,"cut":false,"hidden":true,"merged":[[3,0,3,1],[0,0,0,1],[1,0,1,1],[2,0,2,1]]}
["REPRESENTANTE"]
["GRAN CLIENTE"]
["DISTRIBUIDOR"]
["CODIGO"]
[]
["AÑO","MES"]
[{"$f":"+Portada!D12","v":2026},1]
[{"$f":"+IF(B8=1,A7+1,A7)","v":2026},{"$f":"+IF(B7=12,1,B7+1)","v":2}]
[{"$f":"+IF(B9=1,A8+1,A8)","v":2026},{"$f":"+IF(B8=12,1,B8+1)","v":3}]
[2026,4]
[2026,5]
[2026,6]
[2026,7]
[2026,8]
[2026,9]
[2026,10]
[2026,11]
[2026,12]
[2027,1]
[2027,2]
[2027,3]
[2027,4]
[2027,5]
[2027,6]
[2027,7]
[2027,8]
[2027,9]
[2027,10]
[2027,11]
[2027,12]
[2028,1]
[2028,2]
[2028,3]
[2028,4]
[2028,5]
[2028,6]
[2028,7]
[2028,8]
[2028,9]
[2028,10]
[2028,11]
[2028,12]
[2029,1]
[2029,2]
[2029,3]
[2029,4]
[2029,5]
[2029,6]
[2029,7]
[2029,8]
[2029,9]
[2029,10]
[2029,11]
[2029,12]
[2030,1]
[2030,2]
[2030,3]
[2030,4]
[2030,5]
[2030,6]
[2030,7]
[2030,8]
[2030,9]
[2030,10]
[2030,11]
[2030,12]
[2031,1]
[2031,2]
[2031,3]
[2031,4]
[2031,5]
[2031,6]
[{"$f":"+IF(B73=1,A72+1,A72)","v":2031},{"$f":"+IF(B72=12,1,B72+1)","v":7}]
[2031,8]
[2031,9]
[2031,10]
[2031,11]
[2031,12]
[2032,1]
[2032,2]
[2032,3]
[2032,4]
[2032,5]
[2032,6]
[2032,7]
[2032,8]
[2032,9]
[2032,10]
[2032,11]
[2032,12]
[2033,1]
[2033,2]
[2033,3]
[2033,4]
[2033,5]
[2033,6]
[2033,7]
[2033,8]
[2033,9]
[2033,10]
[2033,11]
[2033,12]
[2034,1]
[2034,2]
[2034,3]
[2034,4]
[2034,5]
[2034,6]
[2034,7]
[2034,8]
[2034,9]
[2034,10]
[2034,11]
[2034,12]
[2035,1]
[2035,2]
[2035,3]
[2035,4]
[2035,5]
[2035,6]
[2035,7]
[2035,8]
[2035,9]
[2035,10]
[2035,11]
[2035,12]
[2036,1]
[2036,2]
[2036,3]
[2036,4]
[2036,5]
[2036,6]
[2036,7]
[2036,8]
[2036,9]
[2036,10]
[{"$f":"+IF(B137=1,A136+1,A136)","v":2036},{"$f":"+IF(B136=12,1,B136+1)","v":11}]
[2036,12]
[2037,1]
[2037,2]
[2037,3]
[2037,4]
[2037,5]
[2037,6]
[2037,7]
[2037,8]
[2037,9]
[2037,10]
[2037,11]
[2037,12]
[2038,1]
[2038,2]
[2038,3]
[2038,4]
[2038,5]
[2038,6]
[2038,7]
[2038,8]
[2038,9]
[2038,10]
[2038,11]
[2038,12]
[2039,1]
[2039,2]
[2039,3]
[2039,4]
[2039,5]
[2039,6]
[2039,7]
[2039,8]
[2039,9]
[2039,10]
[2039,11]
[2039,12]
[2040,1]
[2040,2]
[2040,3]
[2040,4]
[2040,5]
[2040,6]
[2040,7]
[2040,8]
[2040,9]
[2040,10]
[2040,11]
[2040,12]
[2041,1]
[2041,2]
[2041,3]
[2041,4]
[2041,5]
[2041,6]
[2041,7]
[2041,8]
[2041,9]
[2041,10]
[2041,11]
[2041,12]
[2042,1]
[2042,2]
[{"$f":"+IF(B201=1,A200+1,A200)","v":2042},{"$f":"+IF(B200=12,1,B200+1)","v":3}]
[2042,4]
[2042,5]
[2042,6]
[2042,7]
[2042,8]
[2042,9]
[2042,10]
[2042,11]
[2042,12]
[2043,1]
[2043,2]
[2043,3]
[2043,4]
[2043,5]
[2043,6]
[2043,7]
[2043,8]
[2043,9]
[2043,10]
[2043,11]
[2043,12]
[2044,1]
[2044,2]
[2044,3]
[2044,4]
[2044,5]
[2044,6]
[2044,7]
[2044,8]
[2044,9]
[2044,10]
[2044,11]
[2044,12]
[2045,1]
[2045,2]
[2045,3]
[2045,4]
[2045,5]
[2045,6]
[2045,7]
[2045,8]
[2045,9]
[2045,10]
[2045,11]
[2045,12]
[2046,1]
[2046,2]
[2046,3]
[2046,4]
[2046,5]
[2046,6]
[2046,7]
[2046,8]
[2046,9]
[2046,10]
[2046,11]
[2046,12]

{"sheet":"Demanda Interruptible","index":4,"n_rows":258,"n_cols":2,"rows_kept":258,"cut":false,"hidden":true,"merged":[[3,0,3,1],[0,0,0,1],[1,0,1,1],[2,0,2,1]]}
["REPRESENTANTE"]
["GRAN CLIENTE"]
["DISTRIBUIDOR"]
["CODIGO"]
[]
["AÑO","MES"]
[{"$f":"+Portada!D12","v":2026},1]
[{"$f":"+IF(B8=1,A7+1,A7)","v":2026},{"$f":"+IF(B7=12,1,B7+1)","v":2}]
[{"$f":"+IF(B9=1,A8+1,A8)","v":2026},{"$f":"+IF(B8=12,1,B8+1)","v":3}]
[2026,4]
[2026,5]
[2026,6]
[2026,7]
[2026,8]
[2026,9]
[2026,10]
[2026,11]
[2026,12]
[2027,1]
[2027,2]
[2027,3]
[2027,4]
[2027,5]
[2027,6]
[2027,7]
[2027,8]
[2027,9]
[2027,10]
[2027,11]
[2027,12]
[2028,1]
[2028,2]
[2028,3]
[2028,4]
[2028,5]
[2028,6]
[2028,7]
[2028,8]
[2028,9]
[2028,10]
[2028,11]
[2028,12]
[2029,1]
[2029,2]
[2029,3]
[2029,4]
[2029,5]
[2029,6]
[2029,7]
[2029,8]
[2029,9]
[2029,10]
[2029,11]
[2029,12]
[2030,1]
[2030,2]
[2030,3]
[2030,4]
[2030,5]
[2030,6]
[2030,7]
[2030,8]
[2030,9]
[2030,10]
[2030,11]
[2030,12]
[2031,1]
[2031,2]
[2031,3]
[2031,4]
[2031,5]
[2031,6]
[{"$f":"+IF(B73=1,A72+1,A72)","v":2031},{"$f":"+IF(B72=12,1,B72+1)","v":7}]
[2031,8]
[2031,9]
[2031,10]
[2031,11]
[2031,12]
[2032,1]
[2032,2]
[2032,3]
[2032,4]
[2032,5]
[2032,6]
[2032,7]
[2032,8]
[2032,9]
[2032,10]
[2032,11]
[2032,12]
[2033,1]
[2033,2]
[2033,3]
[2033,4]
[2033,5]
[2033,6]
[2033,7]
[2033,8]
[2033,9]
[2033,10]
[2033,11]
[2033,12]
[2034,1]
[2034,2]
[2034,3]
[2034,4]
[2034,5]
[2034,6]
[2034,7]
[2034,8]
[2034,9]
[2034,10]
[2034,11]
[2034,12]
[2035,1]
[2035,2]
[2035,3]
[2035,4]
[2035,5]
[2035,6]
[2035,7]
[2035,8]
[2035,9]
[2035,10]
[2035,11]
[2035,12]
[2036,1]
[2036,2]
[2036,3]
[2036,4]
[2036,5]
[2036,6]
[2036,7]
[2036,8]
[2036,9]
[2036,10]
[{"$f":"+IF(B137=1,A136+1,A136)","v":2036},{"$f":"+IF(B136=12,1,B136+1)","v":11}]
[2036,12]
[2037,1]
[2037,2]
[2037,3]
[2037,4]
[2037,5]
[2037,6]
[2037,7]
[2037,8]
[2037,9]
[2037,10]
[2037,11]
[2037,12]
[2038,1]
[2038,2]
[2038,3]
[2038,4]
[2038,5]
[2038,6]
[2038,7]
[2038,8]
[2038,9]
[2038,10]
[2038,11]
[2038,12]
[2039,1]
[2039,2]
[2039,3]
[2039,4]
[2039,5]
[2039,6]
[2039,7]
[2039,8]
[2039,9]
[2039,10]
[2039,11]
[2039,12]
[2040,1]
[2040,2]
[2040,3]
[2040,4]
[2040,5]
[2040,6]
[2040,7]
[2040,8]
[2040,9]
[2040,10]
[2040,11]
[2040,12]
[2041,1]
[2041,2]
[2041,3]
[2041,4]
[2041,5]
[2041,6]
[2041,7]
[2041,8]
[2041,9]
[2041,10]
[2041,11]
[2041,12]
[2042,1]
[2042,2]
[{"$f":"+IF(B201=1,A200+1,A200)","v":2042},{"$f":"+IF(B200=12,1,B200+1)","v":3}]
[2042,4]
[2042,5]
[2042,6]
[2042,7]
[2042,8]
[2042,9]
[2042,10]
[2042,11]
[2042,12]
[2043,1]
[2043,2]
[2043,3]
[2043,4]
[2043,5]
[2043,6]
[2043,7]
[2043,8]
[2043,9]
[2043,10]
[2043,11]
[2043,12]
[2044,1]
[2044,2]
[2044,3]
[2044,4]
[2044,5]
[2044,6]
[2044,7]
[2044,8]
[2044,9]
[2044,10]
[2044,11]
[2044,12]
[2045,1]
[2045,2]
[2045,3]
[2045,4]
[2045,5]
[2045,6]
[2045,7]
[2045,8]
[2045,9]
[2045,10]
[2045,11]
[2045,12]
[2046,1]
[2046,2]
[2046,3]
[2046,4]
[2046,5]
[2046,6]
[2046,7]
[2046,8]
[2046,9]
[2046,10]
[2046,11]
[2046,12]

{"sheet":"Importacion Contratada","index":5,"n_rows":258,"n_cols":2,"rows_kept":258,"cut":false,"hidden":true,"merged":[[3,0,3,1],[0,0,0,1],[1,0,1,1],[2,0,2,1]]}
["REPRESENTANTE"]
["GRAN CLIENTE"]
["DISTRIBUIDOR"]
["CODIGO"]
[]
["AÑO","MES"]
[{"$f":"+Portada!D12","v":2026},1]
[{"$f":"+IF(B8=1,A7+1,A7)","v":2026},{"$f":"+IF(B7=12,1,B7+1)","v":2}]
[{"$f":"+IF(B9=1,A8+1,A8)","v":2026},{"$f":"+IF(B8=12,1,B8+1)","v":3}]
[2026,4]
[2026,5]
[2026,6]
[2026,7]
[2026,8]
[2026,9]
[2026,10]
[2026,11]
[2026,12]
[2027,1]
[2027,2]
[2027,3]
[2027,4]
[2027,5]
[2027,6]
[2027,7]
[2027,8]
[2027,9]
[2027,10]
[2027,11]
[2027,12]
[2028,1]
[2028,2]
[2028,3]
[2028,4]
[2028,5]
[2028,6]
[2028,7]
[2028,8]
[2028,9]
[2028,10]
[2028,11]
[2028,12]
[2029,1]
[2029,2]
[2029,3]
[2029,4]
[2029,5]
[2029,6]
[2029,7]
[2029,8]
[2029,9]
[2029,10]
[2029,11]
[2029,12]
[2030,1]
[2030,2]
[2030,3]
[2030,4]
[2030,5]
[2030,6]
[2030,7]
[2030,8]
[2030,9]
[2030,10]
[2030,11]
[2030,12]
[2031,1]
[2031,2]
[2031,3]
[2031,4]
[2031,5]
[2031,6]
[{"$f":"+IF(B73=1,A72+1,A72)","v":2031},{"$f":"+IF(B72=12,1,B72+1)","v":7}]
[2031,8]
[2031,9]
[2031,10]
[2031,11]
[2031,12]
[2032,1]
[2032,2]
[2032,3]
[2032,4]
[2032,5]
[2032,6]
[2032,7]
[2032,8]
[2032,9]
[2032,10]
[2032,11]
[2032,12]
[2033,1]
[2033,2]
[2033,3]
[2033,4]
[2033,5]
[2033,6]
[2033,7]
[2033,8]
[2033,9]
[2033,10]
[2033,11]
[2033,12]
[2034,1]
[2034,2]
[2034,3]
[2034,4]
[2034,5]
[2034,6]
[2034,7]
[2034,8]
[2034,9]
[2034,10]
[2034,11]
[2034,12]
[2035,1]
[2035,2]
[2035,3]
[2035,4]
[2035,5]
[2035,6]
[2035,7]
[2035,8]
[2035,9]
[2035,10]
[2035,11]
[2035,12]
[2036,1]
[2036,2]
[2036,3]
[2036,4]
[2036,5]
[2036,6]
[2036,7]
[2036,8]
[2036,9]
[2036,10]
[{"$f":"+IF(B137=1,A136+1,A136)","v":2036},{"$f":"+IF(B136=12,1,B136+1)","v":11}]
[2036,12]
[2037,1]
[2037,2]
[2037,3]
[2037,4]
[2037,5]
[2037,6]
[2037,7]
[2037,8]
[2037,9]
[2037,10]
[2037,11]
[2037,12]
[2038,1]
[2038,2]
[2038,3]
[2038,4]
[2038,5]
[2038,6]
[2038,7]
[2038,8]
[2038,9]
[2038,10]
[2038,11]
[2038,12]
[2039,1]
[2039,2]
[2039,3]
[2039,4]
[2039,5]
[2039,6]
[2039,7]
[2039,8]
[2039,9]
[2039,10]
[2039,11]
[2039,12]
[2040,1]
[2040,2]
[2040,3]
[2040,4]
[2040,5]
[2040,6]
[2040,7]
[2040,8]
[2040,9]
[2040,10]
[2040,11]
[2040,12]
[2041,1]
[2041,2]
[2041,3]
[2041,4]
[2041,5]
[2041,6]
[2041,7]
[2041,8]
[2041,9]
[2041,10]
[2041,11]
[2041,12]
[2042,1]
[2042,2]
[{"$f":"+IF(B201=1,A200+1,A200)","v":2042},{"$f":"+IF(B200=12,1,B200+1)","v":3}]
[2042,4]
[2042,5]
[2042,6]
[2042,7]
[2042,8]
[2042,9]
[2042,10]
[2042,11]
[2042,12]
[2043,1]
[2043,2]
[2043,3]
[2043,4]
[2043,5]
[2043,6]
[2043,7]
[2043,8]
[2043,9]
[2043,10]
[2043,11]
[2043,12]
[2044,1]
[2044,2]
[2044,3]
[2044,4]
[2044,5]
[2044,6]
[2044,7]
[2044,8]
[2044,9]
[2044,10]
[2044,11]
[2044,12]
[2045,1]
[2045,2]
[2045,3]
[2045,4]
[2045,5]
[2045,6]
[2045,7]
[2045,8]
[2045,9]
[2045,10]
[2045,11]
[2045,12]
[2046,1]
[2046,2]
[2046,3]
[2046,4]
[2046,5]
[2046,6]
[2046,7]
[2046,8]
[2046,9]
[2046,10]
[2046,11]
[2046,12]

{"sheet":"DATOS","index":6,"n_rows":1003,"n_cols":8,"rows_kept":1003,"cut":false,"hidden":true,"merged":[]}
["ID_AGENTE","RESPONSABLE","NOMBRE_AGENTE","CONSECION","CODIGO",null,"ID","RESPONSABLES"]
["AG771","ACTIVO","Five Star Management, S. A.","EDEMET","FIVESTAR",null,{"$f":"IF(H2=\"\",\"\",MAX(G$1:G1)+1)","v":1},{"$f":"IFERROR(INDEX(DATOS!$B$2:$B$1003, MATCH(0, INDEX(COUNTIF($H$1:H1, DATOS!$B$2:$B$1003), 0, 0), 0)), \"\")","v":"ACTIVO"}]
["AG256","GRAN CLIENTE ACTIVO","Arce Avícola, S.A. (OLD)","ENSA","ARCEAV",null,{"$f":"IF(H3=\"\",\"\",MAX(G$1:G2)+1)","v":2},{"$f":"IFERROR(INDEX(DATOS!$B$2:$B$1003, MATCH(0, INDEX(COUNTIF($H$1:H2, DATOS!$B$2:$B$1003), 0, 0), 0)), \"\")","v":"GRAN CLIENTE ACTIVO"}]
["AG183","GRAN CLIENTE ACTIVO","Empaques de Colón, S.A.","ENSA","ECSA",null,{"$f":"IF(H4=\"\",\"\",MAX(G$1:G3)+1)","v":3},{"$f":"IFERROR(INDEX(DATOS!$B$2:$B$1003, MATCH(0, INDEX(COUNTIF($H$1:H3, DATOS!$B$2:$B$1003), 0, 0), 0)), \"\")","v":"DISTRIBUIDORES Y AUTOGENERADORES"}]
["AG887","GRAN CLIENTE ACTIVO","Minera Panamá, S. A. (Gran Cliente)",null,"MINPMAGCA",null,{"$f":"IF(H5=\"\",\"\",MAX(G$1:G4)+1)","v":4},{"$f":"IFERROR(INDEX(DATOS!$B$2:$B$1003, MATCH(0, INDEX(COUNTIF($H$1:H4, DATOS!$B$2:$B$1003), 0, 0), 0)), \"\")","v":"AES Panamá, S.R.L."}]
["AG287","GRAN CLIENTE ACTIVO","Autoridad del Canal de Panamá - Planta Potabilizadora Mendoza - Activo","EDEMET","POTMEN",null,{"$f":"IF(H6=\"\",\"\",MAX(G$1:G5)+1)","v":5},{"$f":"IFERROR(INDEX(DATOS!$B$2:$B$1003, MATCH(0, INDEX(COUNTIF($H$1:H5, DATOS!$B$2:$B$1003), 0, 0), 0)), \"\")","v":"Alternegy, S.A."}]
["AG423","GRAN CLIENTE ACTIVO","Panadería Santa Librada – ACTIVO","EDEMET","P_SLIBRADA",null,{"$f":"IF(H7=\"\",\"\",MAX(G$1:G6)+1)","v":6},{"$f":"IFERROR(INDEX(DATOS!$B$2:$B$1003, MATCH(0, INDEX(COUNTIF($H$1:H6, DATOS!$B$2:$B$1003), 0, 0), 0)), \"\")","v":"Argentum Solar, S.A."}]
["AG705","GRAN CLIENTE ACTIVO","Súper Carnes Aguadulce - Importadora Virzi, S.A. (Old)","EDEMET","SCARAG_ACTIVO",null,{"$f":"IF(H8=\"\",\"\",MAX(G$1:G7)+1)","v":7},{"$f":"IFERROR(INDEX(DATOS!$B$2:$B$1003, MATCH(0, INDEX(COUNTIF($H$1:H7, DATOS!$B$2:$B$1003), 0, 0), 0)), \"\")","v":"Autoridad del Canal de Panamá Generador"}]
["AG706","GRAN CLIENTE ACTIVO","Súper Carnes Palermo - Importadora Virzi, S.A. (Old)","EDEMET","SCARPALE_ACTIVO",null,{"$f":"IF(H9=\"\",\"\",MAX(G$1:G8)+1)","v":8},{"$f":"IFERROR(INDEX(DATOS!$B$2:$B$1003, MATCH(0, INDEX(COUNTIF($H$1:H8, DATOS!$B$2:$B$1003), 0, 0), 0)), \"\")","v":"Avanzalia Panamá, S.A."}]
["AG225","GRAN CLIENTE ACTIVO","Servicios de Carnes, S.A.","EDEMET","SERVICAR",null,{"$f":"IF(H10=\"\",\"\",MAX(G$1:G9)+1)","v":9},{"$f":"IFERROR(INDEX(DATOS!$B$2:$B$1003, MATCH(0, INDEX(COUNTIF($H$1:H9, DATOS!$B$2:$B$1003), 0, 0), 0)), \"\")","v":"Capira Solar, S.A."}]
["AG111","DISTRIBUIDORES Y AUTOGENERADORES","Azucarera Nacional, S. A.",null,"ANSA",null,{"$f":"IF(H11=\"\",\"\",MAX(G$1:G10)+1)","v":10},{"$f":"IFERROR(INDEX(DATOS!$B$2:$B$1003, MATCH(0, INDEX(COUNTIF($H$1:H10, DATOS!$B$2:$B$1003), 0, 0), 0)), \"\")","v":"Celsia Centroamérica, S. A."}]
["AG002","DISTRIBUIDORES Y AUTOGENERADORES","Autoridad del Canal de Panamá",null,"ACP",null,{"$f":"IF(H12=\"\",\"\",MAX(G$1:G11)+1)","v":11},{"$f":"IFERROR(INDEX(DATOS!$B$2:$B$1003, MATCH(0, INDEX(COUNTIF($H$1:H11, DATOS!$B$2:$B$1003), 0, 0), 0)), \"\")","v":"Daconan Solar, S.A"}]
["AG640","DISTRIBUIDORES Y AUTOGENERADORES","Central Azucarero de Alanje, S. A.",null,"CADASA",null,{"$f":"IF(H13=\"\",\"\",MAX(G$1:G12)+1)","v":12},{"$f":"IFERROR(INDEX(DATOS!$B$2:$B$1003, MATCH(0, INDEX(COUNTIF($H$1:H12, DATOS!$B$2:$B$1003), 0, 0), 0)), \"\")","v":"Electron Investment, S. A."}]
["AG015","DISTRIBUIDORES Y AUTOGENERADORES","Empresa de Distribución Eléctrica Chiriquí, S. A.",null,"EDECHI",null,{"$f":"IF(H14=\"\",\"\",MAX(G$1:G13)+1)","v":13},{"$f":"IFERROR(INDEX(DATOS!$B$2:$B$1003, MATCH(0, INDEX(COUNTIF($H$1:H13, DATOS!$B$2:$B$1003), 0, 0), 0)), \"\")","v":"Enel Fortuna"}]
["AG014","DISTRIBUIDORES Y AUTOGENERADORES","Empresa de Distribución Eléctrica Metro Oeste, S. A.",null,"EDEMET",null,{"$f":"IF(H15=\"\",\"\",MAX(G$1:G14)+1)","v":14},{"$f":"IFERROR(INDEX(DATOS!$B$2:$B$1003, MATCH(0, INDEX(COUNTIF($H$1:H14, DATOS!$B$2:$B$1003), 0, 0), 0)), \"\")","v":"Enel Renovable, S.R.L"}]
["AG013","DISTRIBUIDORES Y AUTOGENERADORES","Empresa de Distribución Eléctrica Elektra Noreste, S. A.",null,"ENSA",null,{"$f":"IF(H16=\"\",\"\",MAX(G$1:G15)+1)","v":15},{"$f":"IFERROR(INDEX(DATOS!$B$2:$B$1003, MATCH(0, INDEX(COUNTIF($H$1:H15, DATOS!$B$2:$B$1003), 0, 0), 0)), \"\")","v":"Generación Solar, S. A."}]
["AG164","DISTRIBUIDORES Y AUTOGENERADORES","Minera Panamá, S.A.",null,"MINERAPMA",null,{"$f":"IF(H17=\"\",\"\",MAX(G$1:G16)+1)","v":16},{"$f":"IFERROR(INDEX(DATOS!$B$2:$B$1003, MATCH(0, INDEX(COUNTIF($H$1:H16, DATOS!$B$2:$B$1003), 0, 0), 0)), \"\")","v":"Generadora del Istmo, S. A."}]
["AG155","AES Panamá, S.R.L.","Aceti-Oxígeno, S.A.","EDEMET","ACETIOX",null,{"$f":"IF(H18=\"\",\"\",MAX(G$1:G17)+1)","v":17},{"$f":"IFERROR(INDEX(DATOS!$B$2:$B$1003, MATCH(0, INDEX(COUNTIF($H$1:H17, DATOS!$B$2:$B$1003), 0, 0), 0)), \"\")","v":"Hidro Boquerón, S. A."}]
["AG513","AES Panamá, S.R.L.","Agroindustrial CEDI y Carnes (Curundú)","EDEMET","AGCEDICAR",null,{"$f":"IF(H19=\"\",\"\",MAX(G$1:G18)+1)","v":18},{"$f":"IFERROR(INDEX(DATOS!$B$2:$B$1003, MATCH(0, INDEX(COUNTIF($H$1:H18, DATOS!$B$2:$B$1003), 0, 0), 0)), \"\")","v":"Hidro Ibérica, S. A,"}]
["AG585","AES Panamá, S.R.L.","Assa Calle 50","EDEMET","ASSAC50",null,{"$f":"IF(H20=\"\",\"\",MAX(G$1:G19)+1)","v":19},{"$f":"IFERROR(INDEX(DATOS!$B$2:$B$1003, MATCH(0, INDEX(COUNTIF($H$1:H19, DATOS!$B$2:$B$1003), 0, 0), 0)), \"\")","v":"Hidroecológica del Teribe, S. A."}]
["AG458","AES Panamá, S.R.L.","Banco General Centro Operativo","ENSA","BGRALCO64",null,{"$f":"IF(H21=\"\",\"\",MAX(G$1:G20)+1)","v":20},{"$f":"IFERROR(INDEX(DATOS!$B$2:$B$1003, MATCH(0, INDEX(COUNTIF($H$1:H20, DATOS!$B$2:$B$1003), 0, 0), 0)), \"\")","v":"Hidroeléctrica San Lorenzo, S.A."}]
["AG537","AES Panamá, S.R.L.","Banistmo Plaza Edison","EDEMET","BIPEDISON",null,{"$f":"IF(H22=\"\",\"\",MAX(G$1:G21)+1)","v":21},{"$f":"IFERROR(INDEX(DATOS!$B$2:$B$1003, MATCH(0, INDEX(COUNTIF($H$1:H21, DATOS!$B$2:$B$1003), 0, 0), 0)), \"\")","v":"Hidropiedra, S. A."}]
["AG767","AES Panamá, S.R.L.","Bimbo de Panamá, S.A.","EDEMET","BIMBO",null,{"$f":"IF(H23=\"\",\"\",MAX(G$1:G22)+1)","v":22},{"$f":"IFERROR(INDEX(DATOS!$B$2:$B$1003, MATCH(0, INDEX(COUNTIF($H$1:H22, DATOS!$B$2:$B$1003), 0, 0), 0)), \"\")","v":"Hydro Caisan, S. A."}]
["AG855","AES Panamá, S.R.L.","Biomuseo","EDEMET","GCP0628",null,{"$f":"IF(H24=\"\",\"\",MAX(G$1:G23)+1)","v":23},{"$f":"IFERROR(INDEX(DATOS!$B$2:$B$1003, MATCH(0, INDEX(COUNTIF($H$1:H23, DATOS!$B$2:$B$1003), 0, 0), 0)), \"\")","v":"Ideal Panamá, S. A."}]
["AG042","AES Panamá, S.R.L.","Cemento Bayano","ENSA","CEMEX",null,{"$f":"IF(H25=\"\",\"\",MAX(G$1:G24)+1)","v":24},{"$f":"IFERROR(INDEX(DATOS!$B$2:$B$1003, MATCH(0, INDEX(COUNTIF($H$1:H24, DATOS!$B$2:$B$1003), 0, 0), 0)), \"\")","v":"Las Perlas Sur, S. de R. L."}]
["AG507","AES Panamá, S.R.L.","Cemento Bayano Juan Díaz","ENSA","CEMEXJDIAZ",null,{"$f":"IF(H26=\"\",\"\",MAX(G$1:G25)+1)","v":25},{"$f":"IFERROR(INDEX(DATOS!$B$2:$B$1003, MATCH(0, INDEX(COUNTIF($H$1:H25, DATOS!$B$2:$B$1003), 0, 0), 0)), \"\")","v":"PAN-AM Generating Limited, S.A."}]
["AG095","AES Panamá, S.R.L.","Cemento Interoceánico (Industrias Básicas, S. A.)","EDEMET","CEMINTER",null,{"$f":"IF(H27=\"\",\"\",MAX(G$1:G26)+1)","v":26},{"$f":"IFERROR(INDEX(DATOS!$B$2:$B$1003, MATCH(0, INDEX(COUNTIF($H$1:H26, DATOS!$B$2:$B$1003), 0, 0), 0)), \"\")","v":"Panasolar Generation, S.A."}]
["AG827","AES Panamá, S.R.L.","Cervecería Barú","ENSA","GCP0606",null,{"$f":"IF(H28=\"\",\"\",MAX(G$1:G27)+1)","v":27},{"$f":"IFERROR(INDEX(DATOS!$B$2:$B$1003, MATCH(0, INDEX(COUNTIF($H$1:H27, DATOS!$B$2:$B$1003), 0, 0), 0)), \"\")","v":"PSZ1, S. A."}]
["AG138","AES Panamá, S.R.L.","Cervecería Nacional","EDEMET","CNAL",null,{"$f":"IF(H29=\"\",\"\",MAX(G$1:G28)+1)","v":28},{"$f":"IFERROR(INDEX(DATOS!$B$2:$B$1003, MATCH(0, INDEX(COUNTIF($H$1:H28, DATOS!$B$2:$B$1003), 0, 0), 0)), \"\")","v":"Tecnisol I, S.A."}]
["AG088","AES Panamá, S.R.L.","Contraloría General","EDEMET","CONTRAL",null,{"$f":"IF(H30=\"\",\"\",MAX(G$1:G29)+1)","v":29},{"$f":"IFERROR(INDEX(DATOS!$B$2:$B$1003, MATCH(0, INDEX(COUNTIF($H$1:H29, DATOS!$B$2:$B$1003), 0, 0), 0)), \"\")","v":"Tecnisol II, S.A."}]
["AG676","AES Panamá, S.R.L.","Copama Villa Lucre","ENSA","COPAVILU",null,{"$f":"IF(H31=\"\",\"\",MAX(G$1:G30)+1)","v":30},{"$f":"IFERROR(INDEX(DATOS!$B$2:$B$1003, MATCH(0, INDEX(COUNTIF($H$1:H30, DATOS!$B$2:$B$1003), 0, 0), 0)), \"\")","v":"Tecnisol III, S.A."}]
["AG684","AES Panamá, S.R.L.","Corporación Pio Pio  Oficina Llano Bonito","ENSA","MELOOFLBON",null,{"$f":"IF(H32=\"\",\"\",MAX(G$1:G31)+1)","v":31},{"$f":"IFERROR(INDEX(DATOS!$B$2:$B$1003, MATCH(0, INDEX(COUNTIF($H$1:H31, DATOS!$B$2:$B$1003), 0, 0), 0)), \"\")","v":0}]
["AG435","AES Panamá, S.R.L.","Costa del Este Town Center","ENSA","TOWNCENTER",null,{"$f":"IF(H33=\"\",\"\",MAX(G$1:G32)+1)","v":""},{"$f":"IFERROR(INDEX(DATOS!$B$2:$B$1003, MATCH(0, INDEX(COUNTIF($H$1:H32, DATOS!$B$2:$B$1003), 0, 0), 0)), \"\")","v":""}]
["AG173","AES Panamá, S.R.L.","Destilería San Isidro","EDEMET","VH_DES",null,{"$f":"IF(H34=\"\",\"\",MAX(G$1:G33)+1)","v":""},{"$f":"IFERROR(INDEX(DATOS!$B$2:$B$1003, MATCH(0, INDEX(COUNTIF($H$1:H33, DATOS!$B$2:$B$1003), 0, 0), 0)), \"\")","v":""}]
["AG252","AES Panamá, S.R.L.","Edificio Business Park","ENSA","BPARK",null,{"$f":"IF(H35=\"\",\"\",MAX(G$1:G34)+1)","v":""},{"$f":"IFERROR(INDEX(DATOS!$B$2:$B$1003, MATCH(0, INDEX(COUNTIF($H$1:H34, DATOS!$B$2:$B$1003), 0, 0), 0)), \"\")","v":""}]
["AG098","AES Panamá, S.R.L.","Embajada de los Estados Unidos de América","EDEMET","EEUA",null,{"$f":"IF(H36=\"\",\"\",MAX(G$1:G35)+1)","v":""},{"$f":"IFERROR(INDEX(DATOS!$B$2:$B$1003, MATCH(0, INDEX(COUNTIF($H$1:H35, DATOS!$B$2:$B$1003), 0, 0), 0)), \"\")","v":""}]
["AG567","AES Panamá, S.R.L.","Envases Universales Ball de Panamá, S.A.","ENSA","EUBP",null,{"$f":"IF(H37=\"\",\"\",MAX(G$1:G36)+1)","v":""},{"$f":"IFERROR(INDEX(DATOS!$B$2:$B$1003, MATCH(0, INDEX(COUNTIF($H$1:H36, DATOS!$B$2:$B$1003), 0, 0), 0)), \"\")","v":""}]
["AG631","AES Panamá, S.R.L.","Finca de Carriazo","ENSA","FCARRIAZO",null,{"$f":"IF(H38=\"\",\"\",MAX(G$1:G37)+1)","v":""},{"$f":"IFERROR(INDEX(DATOS!$B$2:$B$1003, MATCH(0, INDEX(COUNTIF($H$1:H37, DATOS!$B$2:$B$1003), 0, 0), 0)), \"\")","v":""}]
["AG485","AES Panamá, S.R.L.","Fundación para la Educación en la Televisión, S.A.","ENSA","FETV",null,{"$f":"IF(H39=\"\",\"\",MAX(G$1:G38)+1)","v":""},{"$f":"IFERROR(INDEX(DATOS!$B$2:$B$1003, MATCH(0, INDEX(COUNTIF($H$1:H38, DATOS!$B$2:$B$1003), 0, 0), 0)), \"\")","v":""}]
["AG713","AES Panamá, S.R.L.","Galores Refrigerados, S. A.","ENSA","GALORES",null,{"$f":"IF(H40=\"\",\"\",MAX(G$1:G39)+1)","v":""},{"$f":"IFERROR(INDEX(DATOS!$B$2:$B$1003, MATCH(0, INDEX(COUNTIF($H$1:H39, DATOS!$B$2:$B$1003), 0, 0), 0)), \"\")","v":""}]
["AG913","AES Panamá, S.R.L.","Green Tower Properties, Inc","ENSA","GCP0667",null,{"$f":"IF(H41=\"\",\"\",MAX(G$1:G40)+1)","v":""},{"$f":"IFERROR(INDEX(DATOS!$B$2:$B$1003, MATCH(0, INDEX(COUNTIF($H$1:H40, DATOS!$B$2:$B$1003), 0, 0), 0)), \"\")","v":""}]
["AG496","AES Panamá, S.R.L.","Harina del Istmo, S.A.","ENSA","HARISTMO",null,{"$f":"IF(H42=\"\",\"\",MAX(G$1:G41)+1)","v":""},{"$f":"IFERROR(INDEX(DATOS!$B$2:$B$1003, MATCH(0, INDEX(COUNTIF($H$1:H41, DATOS!$B$2:$B$1003), 0, 0), 0)), \"\")","v":""}]
["AG809","AES Panamá, S.R.L.","Hospital Pacífica Salud Costa del Este","ENSA","HPPCDE",null,{"$f":"IF(H43=\"\",\"\",MAX(G$1:G42)+1)","v":""},{"$f":"IFERROR(INDEX(DATOS!$B$2:$B$1003, MATCH(0, INDEX(COUNTIF($H$1:H42, DATOS!$B$2:$B$1003), 0, 0), 0)), \"\")","v":""}]
["AG792","AES Panamá, S.R.L.","Hospital Punta Pacífica","EDEMET","HPPACIFICA",null,{"$f":"IF(H44=\"\",\"\",MAX(G$1:G43)+1)","v":""},{"$f":"IFERROR(INDEX(DATOS!$B$2:$B$1003, MATCH(0, INDEX(COUNTIF($H$1:H43, DATOS!$B$2:$B$1003), 0, 0), 0)), \"\")","v":""}]
["AG825","AES Panamá, S.R.L.","Hospital Punta Pacífica 3 - Consultorios","EDEMET","GCP0604",null,{"$f":"IF(H45=\"\",\"\",MAX(G$1:G44)+1)","v":""},{"$f":"IFERROR(INDEX(DATOS!$B$2:$B$1003, MATCH(0, INDEX(COUNTIF($H$1:H44, DATOS!$B$2:$B$1003), 0, 0), 0)), \"\")","v":""}]
["AG659","AES Panamá, S.R.L.","Hospital Punta Pacifica 4 - Torres de Enfriamiento","EDEMET","HPUNPAC2",null,{"$f":"IF(H46=\"\",\"\",MAX(G$1:G45)+1)","v":""},{"$f":"IFERROR(INDEX(DATOS!$B$2:$B$1003, MATCH(0, INDEX(COUNTIF($H$1:H45, DATOS!$B$2:$B$1003), 0, 0), 0)), \"\")","v":""}]
["AG499","AES Panamá, S.R.L.","I Storage Inc.","ENSA","ISTORAGE",null,{"$f":"IF(H47=\"\",\"\",MAX(G$1:G46)+1)","v":""},{"$f":"IFERROR(INDEX(DATOS!$B$2:$B$1003, MATCH(0, INDEX(COUNTIF($H$1:H46, DATOS!$B$2:$B$1003), 0, 0), 0)), \"\")","v":""}]
["AG023","AES Panamá, S.R.L.","Mega Depot","EDEMET","MEGAD",null,{"$f":"IF(H48=\"\",\"\",MAX(G$1:G47)+1)","v":""},{"$f":"IFERROR(INDEX(DATOS!$B$2:$B$1003, MATCH(0, INDEX(COUNTIF($H$1:H47, DATOS!$B$2:$B$1003), 0, 0), 0)), \"\")","v":""}]
["AG160","AES Panamá, S.R.L.","Melo EASA Juan Diaz","ENSA","MELOEA",null,{"$f":"IF(H49=\"\",\"\",MAX(G$1:G48)+1)","v":""},{"$f":"IFERROR(INDEX(DATOS!$B$2:$B$1003, MATCH(0, INDEX(COUNTIF($H$1:H48, DATOS!$B$2:$B$1003), 0, 0), 0)), \"\")","v":""}]
["AG683","AES Panamá, S.R.L.","Melo Planta de Cocina Central","ENSA","MELOCOCEN",null,{"$f":"IF(H50=\"\",\"\",MAX(G$1:G49)+1)","v":""},{"$f":"IFERROR(INDEX(DATOS!$B$2:$B$1003, MATCH(0, INDEX(COUNTIF($H$1:H49, DATOS!$B$2:$B$1003), 0, 0), 0)), \"\")","v":""}]
["AG161","AES Panamá, S.R.L.","Melo Planta Manuel Melo","ENSA","MELOMM",null,{"$f":"IF(H51=\"\",\"\",MAX(G$1:G50)+1)","v":""},{"$f":"IFERROR(INDEX(DATOS!$B$2:$B$1003, MATCH(0, INDEX(COUNTIF($H$1:H50, DATOS!$B$2:$B$1003), 0, 0), 0)), \"\")","v":""}]
["AG162","AES Panamá, S.R.L.","Melo Planta Sarasqueta","ENSA","MELOSC",null,{"$f":"IF(H52=\"\",\"\",MAX(G$1:G51)+1)","v":""},{"$f":"IFERROR(INDEX(DATOS!$B$2:$B$1003, MATCH(0, INDEX(COUNTIF($H$1:H51, DATOS!$B$2:$B$1003), 0, 0), 0)), \"\")","v":""}]
["AG163","AES Panamá, S.R.L.","Melo Río Abajo","ENSA","MELORA",null,{"$f":"IF(H53=\"\",\"\",MAX(G$1:G52)+1)","v":""},{"$f":"IFERROR(INDEX(DATOS!$B$2:$B$1003, MATCH(0, INDEX(COUNTIF($H$1:H52, DATOS!$B$2:$B$1003), 0, 0), 0)), \"\")","v":""}]
["AG552","AES Panamá, S.R.L.","Metro de Panamá Estación Los Andes","ENSA","METROAND",null,{"$f":"IF(H54=\"\",\"\",MAX(G$1:G53)+1)","v":""},{"$f":"IFERROR(INDEX(DATOS!$B$2:$B$1003, MATCH(0, INDEX(COUNTIF($H$1:H53, DATOS!$B$2:$B$1003), 0, 0), 0)), \"\")","v":""}]
["AG553","AES Panamá, S.R.L.","Metro de Panamá Estación Plaza 5 de Mayo","EDEMET","METRO5MAY",null,{"$f":"IF(H55=\"\",\"\",MAX(G$1:G54)+1)","v":""},{"$f":"IFERROR(INDEX(DATOS!$B$2:$B$1003, MATCH(0, INDEX(COUNTIF($H$1:H54, DATOS!$B$2:$B$1003), 0, 0), 0)), \"\")","v":""}]
["AG870","AES Panamá, S.R.L.","Mr. Precio (Chitré)","EDEMET","GCP0639",null,{"$f":"IF(H56=\"\",\"\",MAX(G$1:G55)+1)","v":""},{"$f":"IFERROR(INDEX(DATOS!$B$2:$B$1003, MATCH(0, INDEX(COUNTIF($H$1:H55, DATOS!$B$2:$B$1003), 0, 0), 0)), \"\")","v":""}]
["AG527","AES Panamá, S.R.L.","Panafoto Calle 50","EDEMET","PFOTOC50",null,{"$f":"IF(H57=\"\",\"\",MAX(G$1:G56)+1)","v":""},{"$f":"IFERROR(INDEX(DATOS!$B$2:$B$1003, MATCH(0, INDEX(COUNTIF($H$1:H56, DATOS!$B$2:$B$1003), 0, 0), 0)), \"\")","v":""}]
["AG528","AES Panamá, S.R.L.","Panafoto Centenial","ENSA","PFOTOCEN",null,{"$f":"IF(H58=\"\",\"\",MAX(G$1:G57)+1)","v":""},{"$f":"IFERROR(INDEX(DATOS!$B$2:$B$1003, MATCH(0, INDEX(COUNTIF($H$1:H57, DATOS!$B$2:$B$1003), 0, 0), 0)), \"\")","v":""}]
["AG529","AES Panamá, S.R.L.","Panafoto Metromall","ENSA","PFOTOMMALL",null,{"$f":"IF(H59=\"\",\"\",MAX(G$1:G58)+1)","v":""},{"$f":"IFERROR(INDEX(DATOS!$B$2:$B$1003, MATCH(0, INDEX(COUNTIF($H$1:H58, DATOS!$B$2:$B$1003), 0, 0), 0)), \"\")","v":""}]
["AG530","AES Panamá, S.R.L.","Panafoto Zona Libre 1","ENSA","PFOTOZLIB1",null,{"$f":"IF(H60=\"\",\"\",MAX(G$1:G59)+1)","v":""},{"$f":"IFERROR(INDEX(DATOS!$B$2:$B$1003, MATCH(0, INDEX(COUNTIF($H$1:H59, DATOS!$B$2:$B$1003), 0, 0), 0)), \"\")","v":""}]
["AG724","AES Panamá, S.R.L.","Panama Ports Company - Balboa","EDEMET","PPCBALBOA",null,{"$f":"IF(H61=\"\",\"\",MAX(G$1:G60)+1)","v":""}]
["AG725","AES Panamá, S.R.L.","Panama Ports Company - Cristobal","ENSA","PPCCRIST",null,{"$f":"IF(H62=\"\",\"\",MAX(G$1:G61)+1)","v":""}]
["AG914","AES Panamá, S.R.L.","PH Empire Residences","ENSA","GCP0666",null,{"$f":"IF(H63=\"\",\"\",MAX(G$1:G62)+1)","v":""}]
["AG403","AES Panamá, S.R.L.","PH Ocean Two","ENSA","OCEANTWO",null,{"$f":"IF(H64=\"\",\"\",MAX(G$1:G63)+1)","v":""}]
["AG418","AES Panamá, S.R.L.","PH Ten Tower","ENSA","TENTOWER",null,{"$f":"IF(H65=\"\",\"\",MAX(G$1:G64)+1)","v":""}]
["AG383","AES Panamá, S.R.L.","PH Vitri Tower","ENSA","PHVITRI85",null,{"$f":"IF(H66=\"\",\"\",MAX(G$1:G65)+1)","v":""}]
["AG583","AES Panamá, S.R.L.","Producción Panameña de Hielo, S.A.","ENSA","PRODHIELO",null,{"$f":"IF(H67=\"\",\"\",MAX(G$1:G66)+1)","v":""}]
["AG712","AES Panamá, S.R.L.","PSA Panama International Terminal","EDEMET","PSAINTTERM",null,{"$f":"IF(H68=\"\",\"\",MAX(G$1:G67)+1)","v":""}]
["AG890","AES Panamá, S.R.L.","RB Cold Chain, Inc","EDEMET","GCP0653",null,{"$f":"IF(H69=\"\",\"\",MAX(G$1:G68)+1)","v":""}]
["AG506","AES Panamá, S.R.L.","Recuperación de Proteínas, S.A.","ENSA","REDEPROSA",null,{"$f":"IF(H70=\"\",\"\",MAX(G$1:G69)+1)","v":""}]
["AG826","AES Panamá, S.R.L.","Rey Bella Vista","EDEMET","GCP0605",null,{"$f":"IF(H71=\"\",\"\",MAX(G$1:G70)+1)","v":""}]
["AG430","AES Panamá, S.R.L.","Rey Brisas Del Golf","ENSA","REYBGOLF",null,{"$f":"IF(H72=\"\",\"\",MAX(G$1:G71)+1)","v":""}]
["AG708","AES Panamá, S.R.L.","Rey Brisas Norte","ENSA","REYBRINOR",null,{"$f":"IF(H73=\"\",\"\",MAX(G$1:G72)+1)","v":""}]
["AG540","AES Panamá, S.R.L.","Rey Calle 13","ENSA","REYCALLE13",null,{"$f":"IF(H74=\"\",\"\",MAX(G$1:G73)+1)","v":""}]
["AG523","AES Panamá, S.R.L.","Rey Calle 50","EDEMET","REYCALLE50",null,{"$f":"IF(H75=\"\",\"\",MAX(G$1:G74)+1)","v":""}]
["AG451","AES Panamá, S.R.L.","Rey Calle 7","ENSA","REYCALLE7",null,{"$f":"IF(H76=\"\",\"\",MAX(G$1:G75)+1)","v":""}]
["AG526","AES Panamá, S.R.L.","Rey CEDI Frío","EDEMET","CEDIFRIO",null,{"$f":"IF(H77=\"\",\"\",MAX(G$1:G76)+1)","v":""}]
["AG431","AES Panamá, S.R.L.","Rey Centennial","ENSA","REYCENTEN",null,{"$f":"IF(H78=\"\",\"\",MAX(G$1:G77)+1)","v":""}]
["AG428","AES Panamá, S.R.L.","Rey Chanis","ENSA","REYCHANIS",null,{"$f":"IF(H79=\"\",\"\",MAX(G$1:G78)+1)","v":""}]
["AG520","AES Panamá, S.R.L.","Rey Chorrera","EDEMET","REYCHORRE",null,{"$f":"IF(H80=\"\",\"\",MAX(G$1:G79)+1)","v":""}]
["AG432","AES Panamá, S.R.L.","Rey Costa Del Este","ENSA","REYCESTE",null,{"$f":"IF(H81=\"\",\"\",MAX(G$1:G80)+1)","v":""}]
["AG490","AES Panamá, S.R.L.","Rey Costa Verde","EDEMET","REYCVERDE",null,{"$f":"IF(H82=\"\",\"\",MAX(G$1:G81)+1)","v":""}]
["AG452","AES Panamá, S.R.L.","Rey Cuatro Altos","ENSA","REY4ALTOS",null,{"$f":"IF(H83=\"\",\"\",MAX(G$1:G82)+1)","v":""}]
["AG427","AES Panamá, S.R.L.","Rey Dorado","ENSA","REYDORADO",null,{"$f":"IF(H84=\"\",\"\",MAX(G$1:G83)+1)","v":""}]
["AG426","AES Panamá, S.R.L.","Rey Milla 8","ENSA","REYMILLA8",null,{"$f":"IF(H85=\"\",\"\",MAX(G$1:G84)+1)","v":""}]
["AG434","AES Panamá, S.R.L.","Rey Mrp La Cabima","ENSA","REYMPCAB",null,{"$f":"IF(H86=\"\",\"\",MAX(G$1:G85)+1)","v":""}]
["AG469","AES Panamá, S.R.L.","Rey Parque Lefevre","ENSA","REYLEFEVRE",null,{"$f":"IF(H87=\"\",\"\",MAX(G$1:G86)+1)","v":""}]
["AG525","AES Panamá, S.R.L.","Rey Paseo Albrook","EDEMET","REYPASEOAB",null,{"$f":"IF(H88=\"\",\"\",MAX(G$1:G87)+1)","v":""}]
["AG491","AES Panamá, S.R.L.","Rey Paseo Arraiján","EDEMET","REYPARRAIJ",null,{"$f":"IF(H89=\"\",\"\",MAX(G$1:G88)+1)","v":""}]
["AG489","AES Panamá, S.R.L.","Rey Paseo del Valle","EDEMET","REYPVALLE",null,{"$f":"IF(H90=\"\",\"\",MAX(G$1:G89)+1)","v":""}]
["AG538","AES Panamá, S.R.L.","Rey Penonome","EDEMET","REYPME",null,{"$f":"IF(H91=\"\",\"\",MAX(G$1:G90)+1)","v":""}]
["AG453","AES Panamá, S.R.L.","Rey Sabanitas","ENSA","REYSABANI",null,{"$f":"IF(H92=\"\",\"\",MAX(G$1:G91)+1)","v":""}]
["AG470","AES Panamá, S.R.L.","Rey Santa María","ENSA","REYSMARIA",null,{"$f":"IF(H93=\"\",\"\",MAX(G$1:G92)+1)","v":""}]
["AG524","AES Panamá, S.R.L.","Rey Santiago","EDEMET","REYSTGO",null,{"$f":"IF(H94=\"\",\"\",MAX(G$1:G93)+1)","v":""}]
["AG454","AES Panamá, S.R.L.","Rey Versalles","ENSA","REYVERSAL",null,{"$f":"IF(H95=\"\",\"\",MAX(G$1:G94)+1)","v":""}]
["AG522","AES Panamá, S.R.L.","Rey Vía España","EDEMET","REYVESPANA",null,{"$f":"IF(H96=\"\",\"\",MAX(G$1:G95)+1)","v":""}]
["AG429","AES Panamá, S.R.L.","Rey Villa Lucre ","ENSA","REYVLUCRE",null,{"$f":"IF(H97=\"\",\"\",MAX(G$1:G96)+1)","v":""}]
["AG521","AES Panamá, S.R.L.","Rey Vista Alegre","EDEMET","REYVALEGRE",null,{"$f":"IF(H98=\"\",\"\",MAX(G$1:G97)+1)","v":""}]
["AG450","AES Panamá, S.R.L.","Rey 12 de octubre","ENSA","REY12OCT",null,{"$f":"IF(H99=\"\",\"\",MAX(G$1:G98)+1)","v":""}]
["AG433","AES Panamá, S.R.L.","Rey 24 de diciembre","ENSA","REY24DIC",null,{"$f":"IF(H100=\"\",\"\",MAX(G$1:G99)+1)","v":""}]
["AG024","AES Panamá, S.R.L.","Ricamar (Irisa)","ENSA","S99_RMAR",null,{"$f":"IF(H101=\"\",\"\",MAX(G$1:G100)+1)","v":""}]
["AG661","AES Panamá, S.R.L.","ScotiaBank El Dorado","ENSA","SCBANK",null,{"$f":"IF(H102=\"\",\"\",MAX(G$1:G101)+1)","v":""}]
["AG884","AES Panamá, S.R.L.","Super Xtra Chanis","ENSA","GCP0648",null,{"$f":"IF(H103=\"\",\"\",MAX(G$1:G102)+1)","v":""}]
["AG818","AES Panamá, S.R.L.","Super 99 Aguadulce","EDEMET","GCP0597",null,{"$f":"IF(H104=\"\",\"\",MAX(G$1:G103)+1)","v":""}]
["AG056","AES Panamá, S.R.L.","Super 99 Albrook","EDEMET","S99_ALBRO",null,{"$f":"IF(H105=\"\",\"\",MAX(G$1:G104)+1)","v":""}]
["AG080","AES Panamá, S.R.L.","Super 99 Arraijan Valle Hermoso","EDEMET","S99_ARRAJ",null,{"$f":"IF(H106=\"\",\"\",MAX(G$1:G105)+1)","v":""}]
["AG822","AES Panamá, S.R.L.","Super 99 Balboa","ENSA","GCP0601",null,{"$f":"IF(H107=\"\",\"\",MAX(G$1:G106)+1)","v":""}]
["AG820","AES Panamá, S.R.L.","Super 99 Bethania","ENSA","GCP0599",null,{"$f":"IF(H108=\"\",\"\",MAX(G$1:G107)+1)","v":""}]
["AG049","AES Panamá, S.R.L.","Super 99 Brisas del Golf","ENSA","S99_BGOLF",null,{"$f":"IF(H109=\"\",\"\",MAX(G$1:G108)+1)","v":""}]
["AG142","AES Panamá, S.R.L.","Super 99 Brisas del Golf Arraijan","EDEMET","S99_BGOLFA",null,{"$f":"IF(H110=\"\",\"\",MAX(G$1:G109)+1)","v":""}]
["AG821","AES Panamá, S.R.L.","Super 99 Chanis","ENSA","GCP0600",null,{"$f":"IF(H111=\"\",\"\",MAX(G$1:G110)+1)","v":""}]
["AG058","AES Panamá, S.R.L.","Super 99 Chitré","EDEMET","S99_CHITRE",null,{"$f":"IF(H112=\"\",\"\",MAX(G$1:G111)+1)","v":""}]
["AG067","AES Panamá, S.R.L.","Super 99 Colmar","ENSA","S99_COLMAR",null,{"$f":"IF(H113=\"\",\"\",MAX(G$1:G112)+1)","v":""}]
["AG069","AES Panamá, S.R.L.","Super 99 Colón 2000","ENSA","S99_COL2K",null,{"$f":"IF(H114=\"\",\"\",MAX(G$1:G113)+1)","v":""}]
["AG062","AES Panamá, S.R.L.","Super 99 Condado del Rey","ENSA","S99_CONDA",null,{"$f":"IF(H115=\"\",\"\",MAX(G$1:G114)+1)","v":""}]
["AG055","AES Panamá, S.R.L.","Super 99 Coronado","EDEMET","S99_CORON",null,{"$f":"IF(H116=\"\",\"\",MAX(G$1:G115)+1)","v":""}]
["AG048","AES Panamá, S.R.L.","Super 99 Costa del Este","ENSA","S99_COSTAE",null,{"$f":"IF(H117=\"\",\"\",MAX(G$1:G116)+1)","v":""}]
["AG143","AES Panamá, S.R.L.","Super 99 El Coco","EDEMET","S99_COCO",null,{"$f":"IF(H118=\"\",\"\",MAX(G$1:G117)+1)","v":""}]
["AG039","AES Panamá, S.R.L.","Super 99 El Dorado","ENSA","S99_DORADO",null,{"$f":"IF(H119=\"\",\"\",MAX(G$1:G118)+1)","v":""}]
["AG047","AES Panamá, S.R.L.","Super 99 El Faro","ENSA","S99_FARO",null,{"$f":"IF(H120=\"\",\"\",MAX(G$1:G119)+1)","v":""}]
["AG040","AES Panamá, S.R.L.","Super 99 La Cabima","ENSA","S99_CABIMA",null,{"$f":"IF(H121=\"\",\"\",MAX(G$1:G120)+1)","v":""}]
["AG159","AES Panamá, S.R.L.","Super 99 La Chorrera Plaza OnDgo","EDEMET","S99_ODGCHO",null,{"$f":"IF(H122=\"\",\"\",MAX(G$1:G121)+1)","v":""}]
["AG070","AES Panamá, S.R.L.","Super 99 La Doña","ENSA","S99_DONA",null,{"$f":"IF(H123=\"\",\"\",MAX(G$1:G122)+1)","v":""}]
["AG038","AES Panamá, S.R.L.","Super 99 Los Andes","ENSA","S99_ANDES",null,{"$f":"IF(H124=\"\",\"\",MAX(G$1:G123)+1)","v":""}]
["AG152","AES Panamá, S.R.L.","Super 99 Los Andes Mall 2","ENSA","S99_ANDESM",null,{"$f":"IF(H125=\"\",\"\",MAX(G$1:G124)+1)","v":""}]
["AG036","AES Panamá, S.R.L.","Super 99 Los Pueblos","ENSA","S99_PUEBLO",null,{"$f":"IF(H126=\"\",\"\",MAX(G$1:G125)+1)","v":""}]
["AG140","AES Panamá, S.R.L.","Super 99 Mañanitas","ENSA","S99_MANAN",null,{"$f":"IF(H127=\"\",\"\",MAX(G$1:G126)+1)","v":""}]
["AG054","AES Panamá, S.R.L.","Super 99 Matadero de Soná","EDEMET","S99_MSONA",null,{"$f":"IF(H128=\"\",\"\",MAX(G$1:G127)+1)","v":""}]
["AG823","AES Panamá, S.R.L.","Super 99 Megamall","ENSA","GCP0602",null,{"$f":"IF(H129=\"\",\"\",MAX(G$1:G128)+1)","v":""}]
["AG824","AES Panamá, S.R.L.","Super 99 Pedregal","ENSA","GCP0603",null,{"$f":"IF(H130=\"\",\"\",MAX(G$1:G129)+1)","v":""}]
["AG060","AES Panamá, S.R.L.","Super 99 Penonome","EDEMET","S99_PENON",null,{"$f":"IF(H131=\"\",\"\",MAX(G$1:G130)+1)","v":""}]
["AG071","AES Panamá, S.R.L.","Super 99 Plaza Carolina","ENSA","S99_PZACAR",null,{"$f":"IF(H132=\"\",\"\",MAX(G$1:G131)+1)","v":""}]
["AG061","AES Panamá, S.R.L.","Super 99 Plaza Italia","EDEMET","S99_PZAIT",null,{"$f":"IF(H133=\"\",\"\",MAX(G$1:G132)+1)","v":""}]
["AG050","AES Panamá, S.R.L.","Super 99 Plaza Tocumen","ENSA","S99_PZATOC",null,{"$f":"IF(H134=\"\",\"\",MAX(G$1:G133)+1)","v":""}]
["AG072","AES Panamá, S.R.L.","Super 99 Portobelo","ENSA","S99_PORTO",null,{"$f":"IF(H135=\"\",\"\",MAX(G$1:G134)+1)","v":""}]
["AG037","AES Panamá, S.R.L.","Super 99 Puerto Escondido","ENSA","S99_PTOESC",null,{"$f":"IF(H136=\"\",\"\",MAX(G$1:G135)+1)","v":""}]
["AG046","AES Panamá, S.R.L.","Super 99 Punta Pacífica","EDEMET","S99_PTAPAC",null,{"$f":"IF(H137=\"\",\"\",MAX(G$1:G136)+1)","v":""}]
["AG130","AES Panamá, S.R.L.","Super 99 Rio Hato","EDEMET","S99_RHATO",null,{"$f":"IF(H138=\"\",\"\",MAX(G$1:G137)+1)","v":""}]
["AG153","AES Panamá, S.R.L.","Super 99 Sabanitas","ENSA","S99_SABANI",null,{"$f":"IF(H139=\"\",\"\",MAX(G$1:G138)+1)","v":""}]
["AG057","AES Panamá, S.R.L.","Super 99 San Francisco","EDEMET","S99_SANFCO",null,{"$f":"IF(H140=\"\",\"\",MAX(G$1:G139)+1)","v":""}]
["AG059","AES Panamá, S.R.L.","Super 99 Santiago","EDEMET","S99_SANTI",null,{"$f":"IF(H141=\"\",\"\",MAX(G$1:G140)+1)","v":""}]
["AG819","AES Panamá, S.R.L.","Super 99 Town Center Arraijan","EDEMET","GCP0598",null,{"$f":"IF(H142=\"\",\"\",MAX(G$1:G141)+1)","v":""}]
["AG073","AES Panamá, S.R.L.","Super 99 Tumba Muerto","EDEMET","S99_TMUER",null,{"$f":"IF(H143=\"\",\"\",MAX(G$1:G142)+1)","v":""}]
["AG083","AES Panamá, S.R.L.","Super 99 Vacamonte","EDEMET","S99_VACAM",null,{"$f":"IF(H144=\"\",\"\",MAX(G$1:G143)+1)","v":""}]
["AG051","AES Panamá, S.R.L.","Super 99 Vía Porras","EDEMET","S99_VPORR",null,{"$f":"IF(H145=\"\",\"\",MAX(G$1:G144)+1)","v":""}]
["AG151","AES Panamá, S.R.L.","Super 99 Villa Lucre","ENSA","S99_VLUCRE",null,{"$f":"IF(H146=\"\",\"\",MAX(G$1:G145)+1)","v":""}]
["AG141","AES Panamá, S.R.L.","Super 99 Villa Zaita","ENSA","S99_VZAITA",null,{"$f":"IF(H147=\"\",\"\",MAX(G$1:G146)+1)","v":""}]
["AG053","AES Panamá, S.R.L.","Super 99 Vista Hermosa","EDEMET","S99_VHERM",null,{"$f":"IF(H148=\"\",\"\",MAX(G$1:G147)+1)","v":""}]
["AG645","AES Panamá, S.R.L.","Tikal Intercontinental, S.A.","EDEMET","TIKAL",null,{"$f":"IF(H149=\"\",\"\",MAX(G$1:G148)+1)","v":""}]
["AG185","AES Panamá, S.R.L.","Toledano Planta de Proceso","ENSA","TDNO_PMA",null,{"$f":"IF(H150=\"\",\"\",MAX(G$1:G149)+1)","v":""}]
["AG184","AES Panamá, S.R.L.","Toledano Planta Incubadora ","EDEMET","TDNO_CHO",null,{"$f":"IF(H151=\"\",\"\",MAX(G$1:G150)+1)","v":""}]
["AG191","AES Panamá, S.R.L.","Toledano Procesadora de Aves","ENSA","TDNO_PAV",null,{"$f":"IF(H152=\"\",\"\",MAX(G$1:G151)+1)","v":""}]
["AG845","AES Panamá, S.R.L.","Universidad Latina Panamá (Ciencias Salud)","EDEMET","GCP0619",null,{"$f":"IF(H153=\"\",\"\",MAX(G$1:G152)+1)","v":""}]
["AG844","AES Panamá, S.R.L.","Universidad Latina Panamá (Edif. Derecho)","ENSA","GCP0618",null,{"$f":"IF(H154=\"\",\"\",MAX(G$1:G153)+1)","v":""}]
["AG843","AES Panamá, S.R.L.","Universidad Latina Panamá (Sede Central)","ENSA","GCP0617",null,{"$f":"IF(H155=\"\",\"\",MAX(G$1:G154)+1)","v":""}]
["AG769","AES Panamá, S.R.L.","Xtra Aguadulce","EDEMET","XADULCE",null,{"$f":"IF(H156=\"\",\"\",MAX(G$1:G155)+1)","v":""}]
["AG267","AES Panamá, S.R.L.","Xtra Albrook","EDEMET","XALBROOK",null,{"$f":"IF(H157=\"\",\"\",MAX(G$1:G156)+1)","v":""}]
["AG192","AES Panamá, S.R.L.","Xtra Anclas Mall","EDEMET","XANCLAS",null,{"$f":"IF(H158=\"\",\"\",MAX(G$1:G157)+1)","v":""}]
["AG233","AES Panamá, S.R.L.","Xtra Arraiján","EDEMET","XARRAIJ",null,{"$f":"IF(H159=\"\",\"\",MAX(G$1:G158)+1)","v":""}]
["AG424","AES Panamá, S.R.L.","Xtra Cativá","ENSA","XCATIVA",null,{"$f":"IF(H160=\"\",\"\",MAX(G$1:G159)+1)","v":""}]
["AG750","AES Panamá, S.R.L.","Xtra Chepo","ENSA","XCHEPO",null,{"$f":"IF(H161=\"\",\"\",MAX(G$1:G160)+1)","v":""}]
["AG193","AES Panamá, S.R.L.","Xtra Chitre","EDEMET","XCHITRE",null,{"$f":"IF(H162=\"\",\"\",MAX(G$1:G161)+1)","v":""}]
["AG415","AES Panamá, S.R.L.","Xtra Chorrillo","EDEMET","XCHORRILLO",null,{"$f":"IF(H163=\"\",\"\",MAX(G$1:G162)+1)","v":""}]
["AG196","AES Panamá, S.R.L.","Xtra Condado del Rey","ENSA","XCREY",null,{"$f":"IF(H164=\"\",\"\",MAX(G$1:G163)+1)","v":""}]
["AG247","AES Panamá, S.R.L.","Xtra El Coco de la Chorrera","EDEMET","XELCOCO",null,{"$f":"IF(H165=\"\",\"\",MAX(G$1:G164)+1)","v":""}]
["AG197","AES Panamá, S.R.L.","Xtra El Lago","ENSA","XLAGO",null,{"$f":"IF(H166=\"\",\"\",MAX(G$1:G165)+1)","v":""}]
["AG817","AES Panamá, S.R.L.","Xtra La Siesta","ENSA","GCP0596",null,{"$f":"IF(H167=\"\",\"\",MAX(G$1:G166)+1)","v":""}]
["AG198","AES Panamá, S.R.L.","Xtra Las Acacias","ENSA","XACACIA",null,{"$f":"IF(H168=\"\",\"\",MAX(G$1:G167)+1)","v":""}]
["AG623","AES Panamá, S.R.L.","Xtra Las Tablas","EDEMET","XLASTABLAS",null,{"$f":"IF(H169=\"\",\"\",MAX(G$1:G168)+1)","v":""}]
["AG199","AES Panamá, S.R.L.","Xtra Los Pueblos","ENSA","XPUEBLO",null,{"$f":"IF(H170=\"\",\"\",MAX(G$1:G169)+1)","v":""}]
["AG885","AES Panamá, S.R.L.","Xtra MF Gran Estación","ENSA","GCP0649",null,{"$f":"IF(H171=\"\",\"\",MAX(G$1:G170)+1)","v":""}]
["AG200","AES Panamá, S.R.L.","Xtra Monterrico","ENSA","XMRICO",null,{"$f":"IF(H172=\"\",\"\",MAX(G$1:G171)+1)","v":""}]
["AG201","AES Panamá, S.R.L.","Xtra Oficinas Centrales","ENSA","XOFICENT",null,{"$f":"IF(H173=\"\",\"\",MAX(G$1:G172)+1)","v":""}]
["AG202","AES Panamá, S.R.L.","Xtra Ojo de Agua","ENSA","XOAGUA",null,{"$f":"IF(H174=\"\",\"\",MAX(G$1:G173)+1)","v":""}]
["AG203","AES Panamá, S.R.L.","Xtra Pacora","ENSA","XPACORA",null,{"$f":"IF(H175=\"\",\"\",MAX(G$1:G174)+1)","v":""}]
["AG789","AES Panamá, S.R.L.","Xtra Parque Sur","ENSA","XPSUR",null,{"$f":"IF(H176=\"\",\"\",MAX(G$1:G175)+1)","v":""}]
["AG297","AES Panamá, S.R.L.","Xtra Penonomé","EDEMET","XPNOME",null,{"$f":"IF(H177=\"\",\"\",MAX(G$1:G176)+1)","v":""}]
["AG894","AES Panamá, S.R.L.","Xtra Pueblo I","EDEMET","GCP0657",null,{"$f":"IF(H178=\"\",\"\",MAX(G$1:G177)+1)","v":""}]
["AG895","AES Panamá, S.R.L.","Xtra Pueblo II","EDEMET","GCP0658",null,{"$f":"IF(H179=\"\",\"\",MAX(G$1:G178)+1)","v":""}]
["AG206","AES Panamá, S.R.L.","Xtra Sabanitas","ENSA","XSBANITA",null,{"$f":"IF(H180=\"\",\"\",MAX(G$1:G179)+1)","v":""}]
["AG883","AES Panamá, S.R.L.","Xtra San Isidro","ENSA","GCP0647",null,{"$f":"IF(H181=\"\",\"\",MAX(G$1:G180)+1)","v":""}]
["AG204","AES Panamá, S.R.L.","Xtra San Miguelito","ENSA","XSMGTO",null,{"$f":"IF(H182=\"\",\"\",MAX(G$1:G181)+1)","v":""}]
["AG194","AES Panamá, S.R.L.","Xtra Santiago","EDEMET","XSTGO",null,{"$f":"IF(H183=\"\",\"\",MAX(G$1:G182)+1)","v":""}]
["AG709","AES Panamá, S.R.L.","Xtra Terminal Santiago","EDEMET","XTSANTGO",null,{"$f":"IF(H184=\"\",\"\",MAX(G$1:G183)+1)","v":""}]
["AG416","AES Panamá, S.R.L.","Xtra Transísmica","EDEMET","XTRANSIST",null,{"$f":"IF(H185=\"\",\"\",MAX(G$1:G184)+1)","v":""}]
["AG752","AES Panamá, S.R.L.","Xtra Vía Israel","EDEMET","XVISRAEL",null,{"$f":"IF(H186=\"\",\"\",MAX(G$1:G185)+1)","v":""}]
["AG770","AES Panamá, S.R.L.","Xtra Vía La Marquesa","EDEMET","XMARQSA",null,{"$f":"IF(H187=\"\",\"\",MAX(G$1:G186)+1)","v":""}]
["AG205","AES Panamá, S.R.L.","Xtra Villa Lucre","ENSA","XVLUCRE",null,{"$f":"IF(H188=\"\",\"\",MAX(G$1:G187)+1)","v":""}]
["AG749","AES Panamá, S.R.L.","Xtra Villalobos","ENSA","XVLOBOS",null,{"$f":"IF(H189=\"\",\"\",MAX(G$1:G188)+1)","v":""}]
["AG232","AES Panamá, S.R.L.","Xtra Vista Alegre","EDEMET","XVALEGRE",null,{"$f":"IF(H190=\"\",\"\",MAX(G$1:G189)+1)","v":""}]
["AG816","AES Panamá, S.R.L.","Xtra 4 Altos","ENSA","GCP0595",null,{"$f":"IF(H191=\"\",\"\",MAX(G$1:G190)+1)","v":""}]
["AG569","AES Panamá, S.R.L.","3M Panamá Pacífico, S. de R.L.","EDEMET","EDIF3M",null,{"$f":"IF(H192=\"\",\"\",MAX(G$1:G191)+1)","v":""}]
["AG352","Alternegy, S.A.","Aerotel, S.A.","ENSA","HCROWNETOC",null,{"$f":"IF(H193=\"\",\"\",MAX(G$1:G192)+1)","v":""}]
["AG643","Alternegy, S.A.","Alimentos Cárnicos de Panamá PLANTA","ENSA","ALICAPPLAN",null,{"$f":"IF(H194=\"\",\"\",MAX(G$1:G193)+1)","v":""}]
["AG246","Alternegy, S.A.","Cía. Alimentos de Animales, S.A.","EDEMET","CADASAGC",null,{"$f":"IF(H195=\"\",\"\",MAX(G$1:G194)+1)","v":""}]
["AG319","Alternegy, S.A.","Energy Bell Development, Inc","ENSA","EBELL",null,{"$f":"IF(H196=\"\",\"\",MAX(G$1:G195)+1)","v":""}]
["AG301","Alternegy, S.A.","Hotel Crowne Plaza Panamá 5117897","EDEMET","CROWNPMA",null,{"$f":"IF(H197=\"\",\"\",MAX(G$1:G196)+1)","v":""}]
["AG302","Alternegy, S.A.","Hotel Dreams Delight Playa Bonita 5117792","EDEMET","HPBONITA",null,{"$f":"IF(H198=\"\",\"\",MAX(G$1:G197)+1)","v":""}]
["AG300","Alternegy, S.A.","Hotel Holiday Inn Panama Canal 6157018","EDEMET","HHINN",null,{"$f":"IF(H199=\"\",\"\",MAX(G$1:G198)+1)","v":""}]
["AG299","Alternegy, S.A.","Hotel Miramar Intercontinental 5050163","EDEMET","MIRAMAR",null,{"$f":"IF(H200=\"\",\"\",MAX(G$1:G199)+1)","v":""}]
["AG303","Alternegy, S.A.","Inmobiliaría Meridiano, S.A.","EDEMET","LEMERID",null,{"$f":"IF(H201=\"\",\"\",MAX(G$1:G200)+1)","v":""}]
["AG258","Alternegy, S.A.","Pet Panamá","ENSA","PETPMA",null,{"$f":"IF(H202=\"\",\"\",MAX(G$1:G201)+1)","v":""}]
["AG342","Alternegy, S.A.","PH Acqua1","ENSA","PHACQUA1",null,{"$f":"IF(H203=\"\",\"\",MAX(G$1:G202)+1)","v":""}]
["AG359","Alternegy, S.A.","PH Torre Global","EDEMET","PHGLOB78",null,{"$f":"IF(H204=\"\",\"\",MAX(G$1:G203)+1)","v":""}]
["AG437","Alternegy, S.A.","Plásticos Generales","ENSA","PGENERALES",null,{"$f":"IF(H205=\"\",\"\",MAX(G$1:G204)+1)","v":""}]
["AG242","Alternegy, S.A.","Productos Pascual","ENSA","PASCUAL",null,{"$f":"IF(H206=\"\",\"\",MAX(G$1:G205)+1)","v":""}]
["AG438","Alternegy, S.A.","Purissima, S. A.","ENSA","PURISSIMA",null,{"$f":"IF(H207=\"\",\"\",MAX(G$1:G206)+1)","v":""}]
["AG343","Alternegy, S.A.","Silverking Investment Corp.","ENSA","HWESTINCE",null,{"$f":"IF(H208=\"\",\"\",MAX(G$1:G207)+1)","v":""}]
["AG358","Alternegy, S.A.","The Ocean Club","EDEMET","PHTOC71",null,{"$f":"IF(H209=\"\",\"\",MAX(G$1:G208)+1)","v":""}]
["AG314","Alternegy, S.A.","Tropical Resorts International Inc Pma","EDEMET","GAMBOA",null,{"$f":"IF(H210=\"\",\"\",MAX(G$1:G209)+1)","v":""}]
["AG455","Argentum Solar, S.A.","Asamblea de Copropietarios del PH Supercentro el Dorado","ENSA","ASAMCPDOR",null,{"$f":"IF(H211=\"\",\"\",MAX(G$1:G210)+1)","v":""}]
["AG760","Argentum Solar, S.A.","Banco Aliado, S.A.","EDEMET","BANALIADO",null,{"$f":"IF(H212=\"\",\"\",MAX(G$1:G211)+1)","v":""}]
["AG838","Argentum Solar, S.A.","El Super Ahorro","ENSA","GCP0616",null,{"$f":"IF(H213=\"\",\"\",MAX(G$1:G212)+1)","v":""}]
["AG911","Argentum Solar, S.A.","Grupo Ocean, Inc","ENSA","GCP0665",null,{"$f":"IF(H214=\"\",\"\",MAX(G$1:G213)+1)","v":""}]
["AG277","Argentum Solar, S.A.","Harinera Oro del Norte","EDEMET","ORONORTE",null,{"$f":"IF(H215=\"\",\"\",MAX(G$1:G214)+1)","v":""}]
["AG832","Argentum Solar, S.A.","Hotel Ejecutivo S.A.","EDEMET","GCP0611",null,{"$f":"IF(H216=\"\",\"\",MAX(G$1:G215)+1)","v":""}]
["AG907","Argentum Solar, S.A.","Induplast, S. A.","ENSA","GCP0661",null,{"$f":"IF(H217=\"\",\"\",MAX(G$1:G216)+1)","v":""}]
["AG744","Argentum Solar, S.A.","MC Mercacentro S.A.","EDEMET","MERCACEN",null,{"$f":"IF(H218=\"\",\"\",MAX(G$1:G217)+1)","v":""}]
["AG389","Argentum Solar, S.A.","Plastiglas, S.A.","ENSA","PLASTIG25",null,{"$f":"IF(H219=\"\",\"\",MAX(G$1:G218)+1)","v":""}]
["AG691","Argentum Solar, S.A.","Plaza La Felicidad, S. A.","ENSA","PLZFEL"]
["AG546","Argentum Solar, S.A.","Prolacsa","EDEMET","PROLACSA"]
["AG351","Argentum Solar, S.A.","Promotora Supercentro El Dorado, S.A.","ENSA","PROMDOR",null,{"$f":"IF(H222=\"\",\"\",MAX(G$1:G219)+1)","v":""}]
["AG872","Argentum Solar, S.A.","Semilla Plenitud, S. A.","ENSA","GCP0641",null,{"$f":"IF(H223=\"\",\"\",MAX(G$1:G222)+1)","v":""}]
["AG281","Argentum Solar, S.A.","Súper Carnes Canto del Llano","EDEMET","SCARCLLAN",null,{"$f":"IF(H224=\"\",\"\",MAX(G$1:G223)+1)","v":""}]
["AG606","Argentum Solar, S.A.","Super Deli-k","EDEMET","SUPERDELIK",null,{"$f":"IF(H225=\"\",\"\",MAX(G$1:G224)+1)","v":""}]
["AG766","Autoridad del Canal de Panamá Generador","Autoridad del Canal de Panamá - Planta Potabilizadora Mendoza - PASIVO","EDEMET","POTMEN_PS",null,{"$f":"IF(H226=\"\",\"\",MAX(G$1:G225)+1)","v":""}]
["AG793","Avanzalia Panamá, S.A.","Hotel Aloft","EDEMET","HALOFT",null,{"$f":"IF(H227=\"\",\"\",MAX(G$1:G226)+1)","v":""}]
["AG798","Capira Solar, S.A.","Agencia Nuevo Hung Sheng, S.A.","ENSA","HUNGSHENG"]
["AG807","Capira Solar, S.A.","Hotel Ramada S.A.","EDEMET","RAMADA",null,{"$f":"IF(H229=\"\",\"\",MAX(G$1:G227)+1)","v":""}]
["AG804","Capira Solar, S.A.","Productos Lux, S.A.","ENSA","PROLUXSA",null,{"$f":"IF(H230=\"\",\"\",MAX(G$1:G229)+1)","v":""}]
["AG280","Capira Solar, S.A.","Súper Carnes Penonomé","EDEMET","SCARPME",null,{"$f":"IF(H231=\"\",\"\",MAX(G$1:G230)+1)","v":""}]
["AG285","Capira Solar, S.A.","Súper Carnes Vista Alegre","EDEMET","SCARVALG",null,{"$f":"IF(H232=\"\",\"\",MAX(G$1:G231)+1)","v":""}]
["AG399","Celsia Centroamérica, S. A.","Carnes de Coclé, S.A.","EDEMET","CARCOCLE",null,{"$f":"IF(H233=\"\",\"\",MAX(G$1:G232)+1)","v":""}]
["AG918","Celsia Centroamérica, S. A.","Del Monte de Panamá, S.A.","ENSA","GCP0670",null,{"$f":"IF(H234=\"\",\"\",MAX(G$1:G233)+1)","v":""}]
["AG091","Celsia Centroamérica, S. A.","Gold Mills de Panamá, S. A.","EDEMET","GMILLS",null,{"$f":"IF(H235=\"\",\"\",MAX(G$1:G234)+1)","v":""}]
["AG925","Celsia Centroamérica, S. A.","Papelera Istmeña, S. A.","EDEMET","GCP0676",null,{"$f":"IF(H236=\"\",\"\",MAX(G$1:G235)+1)","v":""}]
["AG269","Celsia Centroamérica, S. A.","PH Metro Mall","ENSA","PHMMALL",null,{"$f":"IF(H237=\"\",\"\",MAX(G$1:G236)+1)","v":""}]
["AG919","Celsia Centroamérica, S. A.","Sociedad de Alimentos de Primera, S.A. (BONLAC)","ENSA","GCP0671",null,{"$f":"IF(H238=\"\",\"\",MAX(G$1:G237)+1)","v":""}]
["AG800","Daconan Solar, S.A","Hotel Sand Diamond.","ENSA","HSDIAMOND",null,{"$f":"IF(H239=\"\",\"\",MAX(G$1:G238)+1)","v":""}]
["AG797","Daconan Solar, S.A","International Corporation Utilities Management, S.A.","EDEMET","HCENTR72",null,{"$f":"IF(H240=\"\",\"\",MAX(G$1:G239)+1)","v":""}]
["AG667","Daconan Solar, S.A","PH Ocean Business Plaza","EDEMET","PHOCBUPLZ",null,{"$f":"IF(H241=\"\",\"\",MAX(G$1:G240)+1)","v":""}]
["AG577","Electron Investment, S. A.","Almacenajes, S.A.","ENSA","ALMACENAJE",null,{"$f":"IF(H242=\"\",\"\",MAX(G$1:G241)+1)","v":""}]
["AG493","Electron Investment, S. A.","Arcata Company, Inc.","ENSA","ARCATA",null,{"$f":"IF(H243=\"\",\"\",MAX(G$1:G242)+1)","v":""}]
["AG017","Electron Investment, S. A.","Argos Panamá, S. A.",null,"ARGOS",null,{"$f":"IF(H244=\"\",\"\",MAX(G$1:G243)+1)","v":""}]
["AG610","Electron Investment, S. A.","Brisas de Amador","EDEMET","BRISASDEAM",null,{"$f":"IF(H245=\"\",\"\",MAX(G$1:G244)+1)","v":""}]
["AG847","Electron Investment, S. A.","Casino Crown Chorrera","EDEMET","GCP0621"]
["AG846","Electron Investment, S. A.","Casino Crown Riande Aeropuerto","ENSA","GCP0620",null,{"$f":"IF(H247=\"\",\"\",MAX(G$1:G245)+1)","v":""}]
["AG535","Electron Investment, S. A.","Centro Medico Paitilla 1","EDEMET","CMP1",null,{"$f":"IF(H248=\"\",\"\",MAX(G$1:G247)+1)","v":""}]
["AG536","Electron Investment, S. A.","Centro Medico Paitilla 2","EDEMET","CMP2",null,{"$f":"IF(H249=\"\",\"\",MAX(G$1:G248)+1)","v":""}]
["AG910","Electron Investment, S. A.","Corporación Medcom Panamá, S.A. - Edificio Medcom","ENSA","GCP0664",null,{"$f":"IF(H250=\"\",\"\",MAX(G$1:G249)+1)","v":""}]
["AG620","Electron Investment, S. A.","Crown Casino Hotel Radisson","ENSA","CCROWNHRAD",null,{"$f":"IF(H251=\"\",\"\",MAX(G$1:G250)+1)","v":""}]
["AG186","Electron Investment, S. A.","Crown Continental","EDEMET","C_CONT",null,{"$f":"IF(H252=\"\",\"\",MAX(G$1:G251)+1)","v":""}]
["AG187","Electron Investment, S. A.","Crown Guayacanes","EDEMET","C_GUAY",null,{"$f":"IF(H253=\"\",\"\",MAX(G$1:G252)+1)","v":""}]
["AG188","Electron Investment, S. A.","Crown Hotel Panamá","EDEMET","C_HPMA",null,{"$f":"IF(H254=\"\",\"\",MAX(G$1:G253)+1)","v":""}]
["AG235","Electron Investment, S. A.","Crown Sheraton","EDEMET","C_SHERAT",null,{"$f":"IF(H255=\"\",\"\",MAX(G$1:G254)+1)","v":""}]
["AG189","Electron Investment, S. A.","Crown Solloy","EDEMET","C_SOLLOY",null,{"$f":"IF(H256=\"\",\"\",MAX(G$1:G255)+1)","v":""}]
["AG899","Electron Investment, S. A.","Distribuidora Petro Hielo (Las Mañanitas)","ENSA","GCP0660",null,{"$f":"IF(H257=\"\",\"\",MAX(G$1:G256)+1)","v":""}]
["AG578","Electron Investment, S. A.","Distribuidora Validreed Arraiján Cabecera","EDEMET","MC_ARRCAB",null,{"$f":"IF(H258=\"\",\"\",MAX(G$1:G257)+1)","v":""}]
["AG860","Electron Investment, S. A.","Do It Center (Albrook Mall)","EDEMET","GCP0632",null,{"$f":"IF(H259=\"\",\"\",MAX(G$1:G258)+1)","v":""}]
["AG861","Electron Investment, S. A.","Do It Center (Chitré)","EDEMET","GCP0633",null,{"$f":"IF(H260=\"\",\"\",MAX(G$1:G259)+1)","v":""}]
["AG863","Electron Investment, S. A.","Do It Center (El Dorado)","ENSA","GCP0635",null,{"$f":"IF(H261=\"\",\"\",MAX(G$1:G260)+1)","v":""}]
["AG891","Electron Investment, S. A.","Do it Center (Río Abajo)","ENSA","GCP0654",null,{"$f":"IF(H262=\"\",\"\",MAX(G$1:G261)+1)","v":""}]
["AG864","Electron Investment, S. A.","Do It Center (Westland Mall)","EDEMET","GCP0636"]
["AG350","Electron Investment, S. A.","Doit Center Brisas del Golf","ENSA","DOITBGOL",null,{"$f":"IF(H264=\"\",\"\",MAX(G$1:G262)+1)","v":""}]
["AG345","Electron Investment, S. A.","Doit Center Centenario","ENSA","DOITCENT",null,{"$f":"IF(H265=\"\",\"\",MAX(G$1:G264)+1)","v":""}]
["AG348","Electron Investment, S. A.","Doit Center La Doña","ENSA","DOITLDON",null,{"$f":"IF(H266=\"\",\"\",MAX(G$1:G265)+1)","v":""}]
["AG346","Electron Investment, S. A.","Doit Center Los Pueblos","ENSA","DOITLPUE",null,{"$f":"IF(H267=\"\",\"\",MAX(G$1:G266)+1)","v":""}]
["AG349","Electron Investment, S. A.","Doit Center Tocumen","ENSA","DOITTOC",null,{"$f":"IF(H268=\"\",\"\",MAX(G$1:G267)+1)","v":""}]
["AG344","Electron Investment, S. A.","Doit Center 12 de octubre","ENSA","DOIT12OC",null,{"$f":"IF(H269=\"\",\"\",MAX(G$1:G268)+1)","v":""}]
["AG624","Electron Investment, S. A.","Edificio PH Panamar","EDEMET","PHPANAMAR",null,{"$f":"IF(H270=\"\",\"\",MAX(G$1:G269)+1)","v":""}]
["AG923","Electron Investment, S. A.","Gaming & Services (Fantastic Milla 8)","ENSA","GCP0674",null,{"$f":"IF(H271=\"\",\"\",MAX(G$1:G270)+1)","v":""}]
["AG922","Electron Investment, S. A.","Gaming & Services (Fantastic Town Center)","EDEMET","GCP0673",null,{"$f":"IF(H272=\"\",\"\",MAX(G$1:G271)+1)","v":""}]
["AG876","Electron Investment, S. A.","Grupo Finisterre, S. A. (Marriott Executive Apartments)","EDEMET","GCP0643",null,{"$f":"IF(H273=\"\",\"\",MAX(G$1:G272)+1)","v":""}]
["AG933","Electron Investment, S. A.","Hípica de Panamá (Hipódromo Crown Casino)","ENSA","GCP0680",null,{"$f":"IF(H274=\"\",\"\",MAX(G$1:G273)+1)","v":""}]
["AG932","Electron Investment, S. A.","Hípica de Panamá (Hipódromo Establos)","ENSA","GCP0679",null,{"$f":"IF(H275=\"\",\"\",MAX(G$1:G274)+1)","v":""}]
["AG393","Electron Investment, S. A.","Hotel AC Marriot","EDEMET","ACMARRI97",null,{"$f":"IF(H276=\"\",\"\",MAX(G$1:G275)+1)","v":""}]
["AG924","Electron Investment, S. A.","Inversiones Pañanitas S.A. (Fantastic Mañanitas)","ENSA","GCP0675",null,{"$f":"IF(H277=\"\",\"\",MAX(G$1:G276)+1)","v":""}]
["AG510","Electron Investment, S. A.","Jumbo Market, S. A. - Nuevo Arraiján","EDEMET","TAJO_ARR",null,{"$f":"IF(H278=\"\",\"\",MAX(G$1:G277)+1)","v":""}]
["AG508","Electron Investment, S. A.","Jumbo Market, S. A. - Vacamonte","EDEMET","TAJO_VAC",null,{"$f":"IF(H279=\"\",\"\",MAX(G$1:G278)+1)","v":""}]
["AG908","Electron Investment, S. A.","Jumbo Market, S.A. (Colón)","ENSA","GCP0662",null,{"$f":"IF(H280=\"\",\"\",MAX(G$1:G279)+1)","v":""}]
["AG878","Electron Investment, S. A.","Jumbo Market, S.A. (Costa Verde)","EDEMET","GCP0644",null,{"$f":"IF(H281=\"\",\"\",MAX(G$1:G280)+1)","v":""}]
["AG283","Electron Investment, S. A.","Medcom Cerro Bandera","ENSA","MEDCBAN",null,{"$f":"IF(H282=\"\",\"\",MAX(G$1:G281)+1)","v":""}]
["AG576","Electron Investment, S. A.","Niels Pedersen, S.A.","ENSA","NIELSPED",null,{"$f":"IF(H283=\"\",\"\",MAX(G$1:G282)+1)","v":""}]
["AG575","Electron Investment, S. A.","Pedersen Fine Foods, S.A.","ENSA","PEDFFOODS",null,{"$f":"IF(H284=\"\",\"\",MAX(G$1:G283)+1)","v":""}]
["AG504","Electron Investment, S. A.","Pricesmart Brisas del Golf","ENSA","PRICEBGOLF",null,{"$f":"IF(H285=\"\",\"\",MAX(G$1:G284)+1)","v":""}]
["AG500","Electron Investment, S. A.","Pricesmart Costa Verde","EDEMET","PRICECVERD",null,{"$f":"IF(H286=\"\",\"\",MAX(G$1:G285)+1)","v":""}]
["AG505","Electron Investment, S. A.","Pricesmart Oficinas Administrativas","ENSA","PRICEOADM",null,{"$f":"IF(H287=\"\",\"\",MAX(G$1:G286)+1)","v":""}]
["AG574","Electron Investment, S. A.","Pricesmart Panamá","ENSA","PRICEMPARK",null,{"$f":"IF(H288=\"\",\"\",MAX(G$1:G287)+1)","v":""}]
["AG502","Electron Investment, S. A.","Pricesmart Santiago","EDEMET","PRICESANT",null,{"$f":"IF(H289=\"\",\"\",MAX(G$1:G288)+1)","v":""}]
["AG501","Electron Investment, S. A.","Pricesmart Vía Brasil","EDEMET","PRICEVIABR",null,{"$f":"IF(H290=\"\",\"\",MAX(G$1:G289)+1)","v":""}]
["AG503","Electron Investment, S. A.","Pricesmart Villa De Las Fuentes","ENSA","PRICEVILAF",null,{"$f":"IF(H291=\"\",\"\",MAX(G$1:G290)+1)","v":""}]
["AG603","Electron Investment, S. A.","Shelter Bay Marina, S.A.","ENSA","SHELTER",null,{"$f":"IF(H292=\"\",\"\",MAX(G$1:G291)+1)","v":""}]
["AG920","Electron Investment, S. A.","Validreef, S.A. – McDonald’s Vista Alegre","EDEMET","GCP0672",null,{"$f":"IF(H293=\"\",\"\",MAX(G$1:G292)+1)","v":""}]
["AG176","Enel Fortuna","Agro Industrias Alimenticias de Veraguas, S.A","EDEMET","AGROIND",null,{"$f":"IF(H294=\"\",\"\",MAX(G$1:G293)+1)","v":""}]
["AG711","Enel Fortuna","Alma de Panamá Oeste","EDEMET","ALMPMAOEST",null,{"$f":"IF(H295=\"\",\"\",MAX(G$1:G294)+1)","v":""}]
["AG737","Enel Fortuna","Ancon Entertainment, Inc _N","EDEMET","F_ALBROOK",null,{"$f":"IF(H296=\"\",\"\",MAX(G$1:G295)+1)","v":""}]
["AG440","Enel Fortuna","Arce Avícola Ciudad Radial 357643","ENSA","ARCERADIAL",null,{"$f":"IF(H297=\"\",\"\",MAX(G$1:G296)+1)","v":""}]
["AG460","Enel Fortuna","Arce Avícola Finca Nevadas 726760","ENSA","ARCENEV60",null,{"$f":"IF(H298=\"\",\"\",MAX(G$1:G297)+1)","v":""}]
["AG461","Enel Fortuna","Arce Avícola Finca Perú 705133","ENSA","ARCEPERU33",null,{"$f":"IF(H299=\"\",\"\",MAX(G$1:G298)+1)","v":""}]
["AG441","Enel Fortuna","Arce Avícola La Mesa de San Martín 878592","ENSA","ARCELAMESA",null,{"$f":"IF(H300=\"\",\"\",MAX(G$1:G299)+1)","v":""}]
["AG472","Enel Fortuna","Arce Avícola Planta de Huevos Fértiles 266785","ENSA","AHUEFER85",null,{"$f":"IF(H301=\"\",\"\",MAX(G$1:G300)+1)","v":""}]
["AG406","Enel Fortuna","Arce Avícola, S.A.","ENSA","ARCEAV_P",null,{"$f":"IF(H302=\"\",\"\",MAX(G$1:G301)+1)","v":""}]
["AG627","Enel Fortuna","Asamblea de Propietarios PH Yacht Club Tower","EDEMET","PHYCLUB",null,{"$f":"IF(H303=\"\",\"\",MAX(G$1:G302)+1)","v":""}]
["AG759","Enel Fortuna","Aseguradora Ancón S.A","ENSA","ASEGANCON",null,{"$f":"IF(H304=\"\",\"\",MAX(G$1:G303)+1)","v":""}]
["AG726","Enel Fortuna","Automotora Autostar, S.A.","EDEMET","AUTOSTAR",null,{"$f":"IF(H305=\"\",\"\",MAX(G$1:G304)+1)","v":""}]
["AG739","Enel Fortuna","Banistmo, S. A.","EDEMET","TBANISTMO",null,{"$f":"IF(H306=\"\",\"\",MAX(G$1:G305)+1)","v":""}]
["AG738","Enel Fortuna","Bingo 90 _N","EDEMET","F_BINGO90",null,{"$f":"IF(H307=\"\",\"\",MAX(G$1:G306)+1)","v":""}]
["AG811","Enel Fortuna","City Mall Paso Canoas","EDECHI","CYMALLPC",null,{"$f":"IF(H308=\"\",\"\",MAX(G$1:G307)+1)","v":""}]
["AG707","Enel Fortuna","Compañía Invirmar","EDEMET","HGDAVID",null,{"$f":"IF(H309=\"\",\"\",MAX(G$1:G308)+1)","v":""}]
["AG836","Enel Fortuna","Compañía Panameña de Aviación, S. A.","EDEMET","GCP0615",null,{"$f":"IF(H310=\"\",\"\",MAX(G$1:G309)+1)","v":""}]
["AG741","Enel Fortuna","Corporación del presidente de la iglesia de Jesucristo de los Santos de los últimos días","EDEMET","CORPCRISTO",null,{"$f":"IF(H311=\"\",\"\",MAX(G$1:G310)+1)","v":""}]
["AG236","Enel Fortuna","C&W Aguadulce","EDEMET","CWAGUAS",null,{"$f":"IF(H312=\"\",\"\",MAX(G$1:G311)+1)","v":""}]
["AG243","Enel Fortuna","C&W Colón","ENSA","CWCOLON",null,{"$f":"IF(H313=\"\",\"\",MAX(G$1:G312)+1)","v":""}]
["AG237","Enel Fortuna","C&W David","EDECHI","CWDAVID",null,{"$f":"IF(H314=\"\",\"\",MAX(G$1:G313)+1)","v":""}]
["AG241","Enel Fortuna","C&W El Dorado","ENSA","CWDORADO",null,{"$f":"IF(H315=\"\",\"\",MAX(G$1:G314)+1)","v":""}]
["AG229","Enel Fortuna","C&W IDC Balboa","EDEMET","CWBAL",null,{"$f":"IF(H316=\"\",\"\",MAX(G$1:G315)+1)","v":""}]
["AG245","Enel Fortuna","C&W IDC Howard PA","EDEMET","CWHOPA",null,{"$f":"IF(H317=\"\",\"\",MAX(G$1:G316)+1)","v":""}]
["AG230","Enel Fortuna","C&W IDC Howard PB","EDEMET","CWHOPB",null,{"$f":"IF(H318=\"\",\"\",MAX(G$1:G317)+1)","v":""}]
["AG239","Enel Fortuna","C&W Juan Franco # 1","EDEMET","CWJFRA1",null,{"$f":"IF(H319=\"\",\"\",MAX(G$1:G318)+1)","v":""}]
["AG231","Enel Fortuna","C&W Juan Franco #2","EDEMET","CWJFRA2",null,{"$f":"IF(H320=\"\",\"\",MAX(G$1:G319)+1)","v":""}]
["AG238","Enel Fortuna","C&W La Exposición","EDEMET","CWEXP",null,{"$f":"IF(H321=\"\",\"\",MAX(G$1:G320)+1)","v":""}]
["AG240","Enel Fortuna","C&W Río Abajo","ENSA","CWRABAJO",null,{"$f":"IF(H322=\"\",\"\",MAX(G$1:G321)+1)","v":""}]
["AG244","Enel Fortuna","C&W San Francisco","EDEMET","CWSANFCO",null,{"$f":"IF(H323=\"\",\"\",MAX(G$1:G322)+1)","v":""}]
["AG234","Enel Fortuna","C&W Santa Clara","ENSA","CWSCLARA",null,{"$f":"IF(H324=\"\",\"\",MAX(G$1:G323)+1)","v":""}]
["AG729","Enel Fortuna","Fantastic Caribe _N","EDEMET","F_CARIBEN",null,{"$f":"IF(H325=\"\",\"\",MAX(G$1:G324)+1)","v":""}]
["AG734","Enel Fortuna","Fantastic Casa Miller _N","EDEMET","F_CMILLER",null,{"$f":"IF(H326=\"\",\"\",MAX(G$1:G325)+1)","v":""}]
["AG471","Enel Fortuna","Fantastic Casino Aguadulce","EDEMET","FC_AGDCE",null,{"$f":"IF(H327=\"\",\"\",MAX(G$1:G326)+1)","v":""}]
["AG721","Enel Fortuna","Fantastic Casino Anclas Mall","EDEMET","F_ANCLASM",null,{"$f":"IF(H328=\"\",\"\",MAX(G$1:G327)+1)","v":""}]
["AG463","Enel Fortuna","Fantastic Casino El Dorado","ENSA","FC_DORADO",null,{"$f":"IF(H329=\"\",\"\",MAX(G$1:G328)+1)","v":""}]
["AG462","Enel Fortuna","Fantastic Casino Gran Estación","ENSA","FC_GRANEST",null,{"$f":"IF(H330=\"\",\"\",MAX(G$1:G329)+1)","v":""}]
["AG474","Enel Fortuna","Fantastic Casino Internacional 1","EDEMET","FC_INTERN1",null,{"$f":"IF(H331=\"\",\"\",MAX(G$1:G330)+1)","v":""}]
["AG534","Enel Fortuna","Fantastic Casino La Bolera","ENSA","FC_BOLERA",null,{"$f":"IF(H332=\"\",\"\",MAX(G$1:G331)+1)","v":""}]
["AG467","Enel Fortuna","Fantastic Casino La Cabima","ENSA","FC_CABIMA",null,{"$f":"IF(H333=\"\",\"\",MAX(G$1:G332)+1)","v":""}]
["AG466","Enel Fortuna","Fantastic Casino La Doña","ENSA","FC_LADONA",null,{"$f":"IF(H334=\"\",\"\",MAX(G$1:G333)+1)","v":""}]
["AG479","Enel Fortuna","Fantastic Casino Los Andes","ENSA","FC_LANDES",null,{"$f":"IF(H335=\"\",\"\",MAX(G$1:G334)+1)","v":""}]
["AG464","Enel Fortuna","Fantastic Casino Los Pueblos","ENSA","FC_PUEBLO",null,{"$f":"IF(H336=\"\",\"\",MAX(G$1:G335)+1)","v":""}]
["AG465","Enel Fortuna","Fantastic Casino Plaza Tocumen","ENSA","FC_PZATOC",null,{"$f":"IF(H337=\"\",\"\",MAX(G$1:G336)+1)","v":""}]
["AG851","Enel Fortuna","Fantastic Casino San Miguelito","ENSA","GCP0624",null,{"$f":"IF(H338=\"\",\"\",MAX(G$1:G337)+1)","v":""}]
["AG730","Enel Fortuna","Fantastic Chitré _N","EDEMET","F_CHITREN",null,{"$f":"IF(H339=\"\",\"\",MAX(G$1:G338)+1)","v":""}]
["AG731","Enel Fortuna","Fantastic Chorrera _N","EDEMET","F_CHORRERA",null,{"$f":"IF(H340=\"\",\"\",MAX(G$1:G339)+1)","v":""}]
["AG678","Enel Fortuna","Fantastic Oficinas Principales","EDEMET","FCOFPRIN",null,{"$f":"IF(H341=\"\",\"\",MAX(G$1:G340)+1)","v":""}]
["AG732","Enel Fortuna","Fantastic Penonomé _N","EDEMET","F_PENOME",null,{"$f":"IF(H342=\"\",\"\",MAX(G$1:G341)+1)","v":""}]
["AG733","Enel Fortuna","Fantastic Santiago _N","EDEMET","F_SANTGO",null,{"$f":"IF(H343=\"\",\"\",MAX(G$1:G342)+1)","v":""}]
["AG735","Enel Fortuna","Fantastic Villa Zaita _N","ENSA","F_VZAITA",null,{"$f":"IF(H344=\"\",\"\",MAX(G$1:G343)+1)","v":""}]
["AG736","Enel Fortuna","Fantastic Vista Alegre _N","EDEMET","F_VALEGRE",null,{"$f":"IF(H345=\"\",\"\",MAX(G$1:G344)+1)","v":""}]
["AG828","Enel Fortuna","Farmacia Arrocha S.A Federal Mall","EDECHI","GCP0607",null,{"$f":"IF(H346=\"\",\"\",MAX(G$1:G345)+1)","v":""}]
["AG370","Enel Fortuna","Farmacias Arrocha Albrook Mall","EDEMET","FAABRM42",null,{"$f":"IF(H347=\"\",\"\",MAX(G$1:G346)+1)","v":""}]
["AG367","Enel Fortuna","Farmacias Arrocha Brisas del Golf","ENSA","FABGOL74",null,{"$f":"IF(H348=\"\",\"\",MAX(G$1:G347)+1)","v":""}]
["AG373","Enel Fortuna","Farmacias Arrocha Calle 50","EDEMET","FA50CA21",null,{"$f":"IF(H349=\"\",\"\",MAX(G$1:G348)+1)","v":""}]
["AG362","Enel Fortuna","Farmacias Arrocha CEDI 1 Las Cumbres","ENSA","FA1CEDI69",null,{"$f":"IF(H350=\"\",\"\",MAX(G$1:G349)+1)","v":""}]
["AG363","Enel Fortuna","Farmacias Arrocha CEDI 2 Las Cumbres","ENSA","FA2CEDI64",null,{"$f":"IF(H351=\"\",\"\",MAX(G$1:G350)+1)","v":""}]
["AG364","Enel Fortuna","Farmacias Arrocha CEDI 3 Las Cumbres","ENSA","FA3CEDI70",null,{"$f":"IF(H352=\"\",\"\",MAX(G$1:G351)+1)","v":""}]
["AG365","Enel Fortuna","Farmacias Arrocha CEDI 4 Las Cumbres","ENSA","FA4CEDI73",null,{"$f":"IF(H353=\"\",\"\",MAX(G$1:G352)+1)","v":""}]
["AG366","Enel Fortuna","Farmacias Arrocha CEDI 5 Las Cumbres","ENSA","FA5CEDI85",null,{"$f":"IF(H354=\"\",\"\",MAX(G$1:G353)+1)","v":""}]
["AG360","Enel Fortuna","Farmacias Arrocha Centenial","ENSA","FACENT92",null,{"$f":"IF(H355=\"\",\"\",MAX(G$1:G354)+1)","v":""}]
["AG378","Enel Fortuna","Farmacias Arrocha Chitré Paseo Central","EDEMET","FACHIPC91",null,{"$f":"IF(H356=\"\",\"\",MAX(G$1:G355)+1)","v":""}]
["AG377","Enel Fortuna","Farmacias Arrocha Costa Verde","EDEMET","FACVERD57",null,{"$f":"IF(H357=\"\",\"\",MAX(G$1:G356)+1)","v":""}]
["AG380","Enel Fortuna","Farmacias Arrocha David Plaza Terronal","EDECHI","FADAVPT75",null,{"$f":"IF(H358=\"\",\"\",MAX(G$1:G357)+1)","v":""}]
["AG251","Enel Fortuna","Farmacias Arrocha Los Andes","ENSA","FALANDE02",null,{"$f":"IF(H359=\"\",\"\",MAX(G$1:G358)+1)","v":""}]
["AG288","Enel Fortuna","Farmacias Arrocha Los Pueblos","ENSA","FALPUEB94",null,{"$f":"IF(H360=\"\",\"\",MAX(G$1:G359)+1)","v":""}]
["AG371","Enel Fortuna","Farmacias Arrocha Oficina 1 Los Ángeles","EDEMET","FAOF1LA14",null,{"$f":"IF(H361=\"\",\"\",MAX(G$1:G360)+1)","v":""}]
["AG392","Enel Fortuna","Farmacias Arrocha Penonomé","EDEMET","FAPME54",null,{"$f":"IF(H362=\"\",\"\",MAX(G$1:G361)+1)","v":""}]
["AG379","Enel Fortuna","Farmacias Arrocha Santiago Boulevard","EDEMET","FASANTB81",null,{"$f":"IF(H363=\"\",\"\",MAX(G$1:G362)+1)","v":""}]
["AG274","Enel Fortuna","Farmacias Arrocha Tumba Muerto","ENSA","FATMUER63",null,{"$f":"IF(H364=\"\",\"\",MAX(G$1:G363)+1)","v":""}]
["AG361","Enel Fortuna","Farmacias Arrocha Villa Lucre","ENSA","FAVLUC26",null,{"$f":"IF(H365=\"\",\"\",MAX(G$1:G364)+1)","v":""}]
["AG374","Enel Fortuna","Farmacias Arrocha Westland Mall 1","EDEMET","FA1WESM89",null,{"$f":"IF(H366=\"\",\"\",MAX(G$1:G365)+1)","v":""}]
["AG376","Enel Fortuna","Farmacias Arrocha Westland Mall 2","EDEMET","FA2WESM91",null,{"$f":"IF(H367=\"\",\"\",MAX(G$1:G366)+1)","v":""}]
["AG369","Enel Fortuna","Farmacias Arrocha 12 de Octubre","EDEMET","FA12OC96",null,{"$f":"IF(H368=\"\",\"\",MAX(G$1:G367)+1)","v":""}]
["AG679","Enel Fortuna","Fuerte Amador Resort & Marina, S.A. ","EDEMET","FLAMAR1",null,{"$f":"IF(H369=\"\",\"\",MAX(G$1:G368)+1)","v":""}]
["AG630","Enel Fortuna","Fundación Ciudad del Saber","EDEMET","CDELSABER",null,{"$f":"IF(H370=\"\",\"\",MAX(G$1:G369)+1)","v":""}]
["AG805","Enel Fortuna","Fundación Mall City","EDECHI","FMCITY",null,{"$f":"IF(H371=\"\",\"\",MAX(G$1:G370)+1)","v":""}]
["AG548","Enel Fortuna","GPH, El Dorado","ENSA","GPH_SAKSDO",null,{"$f":"IF(H372=\"\",\"\",MAX(G$1:G371)+1)","v":""}]
["AG481","Enel Fortuna","Grupo Primavera Holding Los Andes","ENSA","GPH_DORLAN",null,{"$f":"IF(H373=\"\",\"\",MAX(G$1:G372)+1)","v":""}]
["AG480","Enel Fortuna","Grupo Primavera Holding Los Pueblos","ENSA","GPH_SAKSLP",null,{"$f":"IF(H374=\"\",\"\",MAX(G$1:G373)+1)","v":""}]
["AG482","Enel Fortuna","Grupo Primavera Holding San Miguelito","ENSA","GPH_SAKSSM",null,{"$f":"IF(H375=\"\",\"\",MAX(G$1:G374)+1)","v":""}]
["AG477","Enel Fortuna","Grupo Primavera Holdings Albrook","EDEMET","GPH_DORABK",null,{"$f":"IF(H376=\"\",\"\",MAX(G$1:G375)+1)","v":""}]
["AG626","Enel Fortuna","Hotel Double Tree","EDEMET","HDOUBLE",null,{"$f":"IF(H377=\"\",\"\",MAX(G$1:G376)+1)","v":""}]
["AG790","Enel Fortuna","Hotel Wyndham Albrook","EDEMET","HWYND_ALB",null,{"$f":"IF(H378=\"\",\"\",MAX(G$1:G377)+1)","v":""}]
["AG776","Enel Fortuna","Hoteles Decamerón, S.A.","EDEMET","DECAMERON",null,{"$f":"IF(H379=\"\",\"\",MAX(G$1:G378)+1)","v":""}]
["AG852","Enel Fortuna","Importadora Virzi, S. A. (Oficinas Centrales)","EDEMET","GCP0625",null,{"$f":"IF(H380=\"\",\"\",MAX(G$1:G379)+1)","v":""}]
["AG853","Enel Fortuna","Importadora Virzi, S. A. (Paseo Miramar, La Chorrera)","EDEMET","GCP0626",null,{"$f":"IF(H381=\"\",\"\",MAX(G$1:G380)+1)","v":""}]
["AG854","Enel Fortuna","Importadora Virzi, S. A. (Super Carnes Santiago Central 2)","EDEMET","GCP0627",null,{"$f":"IF(H382=\"\",\"\",MAX(G$1:G381)+1)","v":""}]
["AG156","Enel Fortuna","Industria Panameña de Papel, S.A.","ENSA","IPEL",null,{"$f":"IF(H383=\"\",\"\",MAX(G$1:G382)+1)","v":""}]
["AG384","Enel Fortuna","Inversiones Vilma, S.A.","ENSA","MPFRIGO57",null,{"$f":"IF(H384=\"\",\"\",MAX(G$1:G383)+1)","v":""}]
["AG571","Enel Fortuna","Jerusalem de Panamá, S.A.","EDECHI","JERUSALEM",null,{"$f":"IF(H385=\"\",\"\",MAX(G$1:G384)+1)","v":""}]
["AG638","Enel Fortuna","Jumbo Market","ENSA","JUMBO",null,{"$f":"IF(H386=\"\",\"\",MAX(G$1:G385)+1)","v":""}]
["AG710","Enel Fortuna","Jumbo Market Chanis","ENSA","JUMBOCH",null,{"$f":"IF(H387=\"\",\"\",MAX(G$1:G386)+1)","v":""}]
["AG616","Enel Fortuna","KFC Centennial","ENSA","KFCCENTEN",null,{"$f":"IF(H388=\"\",\"\",MAX(G$1:G387)+1)","v":""}]
["AG644","Enel Fortuna","Kio Networks","EDEMET","KNETWORKS",null,{"$f":"IF(H389=\"\",\"\",MAX(G$1:G388)+1)","v":""}]
["AG456","Enel Fortuna","London & Regional Panama","EDEMET","LONDONREG",null,{"$f":"IF(H390=\"\",\"\",MAX(G$1:G389)+1)","v":""}]
["AG357","Enel Fortuna","Machetazo Arraiján 6057243","EDEMET","MARRAI43",null,{"$f":"IF(H391=\"\",\"\",MAX(G$1:G390)+1)","v":""}]
["AG395","Enel Fortuna","Machetazo Brisas del Golf 21161992","ENSA","MBGOLF92",null,{"$f":"IF(H392=\"\",\"\",MAX(G$1:G391)+1)","v":""}]
["AG398","Enel Fortuna","Machetazo Calidonia","EDEMET","MCALI43",null,{"$f":"IF(H393=\"\",\"\",MAX(G$1:G392)+1)","v":""}]
["AG356","Enel Fortuna","Machetazo Calidonia 5050142","EDEMET","MCALID42",null,{"$f":"IF(H394=\"\",\"\",MAX(G$1:G393)+1)","v":""}]
["AG447","Enel Fortuna","Machetazo Calidonia 5055703","EDEMET","MCALI703",null,{"$f":"IF(H395=\"\",\"\",MAX(G$1:G394)+1)","v":""}]
["AG889","Enel Fortuna","Machetazo Cedi Milla 8","ENSA","GCP0652",null,{"$f":"IF(H396=\"\",\"\",MAX(G$1:G395)+1)","v":""}]
["AG402","Enel Fortuna","Machetazo Chitré","EDEMET","MCHITRE86",null,{"$f":"IF(H397=\"\",\"\",MAX(G$1:G396)+1)","v":""}]
["AG401","Enel Fortuna","Machetazo Coronado 6240012","EDEMET","MCORO12",null,{"$f":"IF(H398=\"\",\"\",MAX(G$1:G397)+1)","v":""}]
["AG421","Enel Fortuna","Machetazo Costa Sur 21038288","ENSA","MCSUR88",null,{"$f":"IF(H399=\"\",\"\",MAX(G$1:G398)+1)","v":""}]
["AG857","Enel Fortuna","Machetazo El Dorado","ENSA","GCP0630",null,{"$f":"IF(H400=\"\",\"\",MAX(G$1:G399)+1)","v":""}]
["AG410","Enel Fortuna","Machetazo Metromall 818731","ENSA","MMALL31",null,{"$f":"IF(H401=\"\",\"\",MAX(G$1:G400)+1)","v":""}]
["AG396","Enel Fortuna","Machetazo Nuevo Tocumen 21167117","ENSA","MNTOC17",null,{"$f":"IF(H402=\"\",\"\",MAX(G$1:G401)+1)","v":""}]
["AG355","Enel Fortuna","Machetazo Penonomé 6045583","EDEMET","MPME83",null,{"$f":"IF(H403=\"\",\"\",MAX(G$1:G402)+1)","v":""}]
["AG448","Enel Fortuna","Machetazo San Miguelito","ENSA","MSANM",null,{"$f":"IF(H404=\"\",\"\",MAX(G$1:G403)+1)","v":""}]
["AG412","Enel Fortuna","Machetazo Santa Ana","EDEMET","MSTANA",null,{"$f":"IF(H405=\"\",\"\",MAX(G$1:G404)+1)","v":""}]
["AG400","Enel Fortuna","Machetazo Santiago 4008026","EDEMET","MSGO26",null,{"$f":"IF(H406=\"\",\"\",MAX(G$1:G405)+1)","v":""}]
["AG439","Enel Fortuna","Machetazo Super Pollmart","EDEMET","MSPOLL",null,{"$f":"IF(H407=\"\",\"\",MAX(G$1:G406)+1)","v":""}]
["AG425","Enel Fortuna","Machetazo Tocumen 505355","ENSA","MTOC55",null,{"$f":"IF(H408=\"\",\"\",MAX(G$1:G407)+1)","v":""}]
["AG132","Enel Fortuna","Manzanillo International Terminal Panamá, S.A.","ENSA","MANZANILLO",null,{"$f":"IF(H409=\"\",\"\",MAX(G$1:G408)+1)","v":""}]
["AG680","Enel Fortuna","Matadero Chiriquí, S.A.","EDECHI","MACHIR",null,{"$f":"IF(H410=\"\",\"\",MAX(G$1:G409)+1)","v":""}]
["AG648","Enel Fortuna","Mays Zona Libre, S.A. - Circuito Eléctrico","ENSA","MAYSCELECT",null,{"$f":"IF(H411=\"\",\"\",MAX(G$1:G410)+1)","v":""}]
["AG639","Enel Fortuna","Mays Zona Libre, S.A. - Principal","ENSA","MAYSZL1",null,{"$f":"IF(H412=\"\",\"\",MAX(G$1:G411)+1)","v":""}]
["AG594","Enel Fortuna","Nikos Balboa","EDEMET","NIKOBAL",null,{"$f":"IF(H413=\"\",\"\",MAX(G$1:G412)+1)","v":""}]
["AG593","Enel Fortuna","Nikos Calle 50","EDEMET","NIKOC50",null,{"$f":"IF(H414=\"\",\"\",MAX(G$1:G413)+1)","v":""}]
["AG602","Enel Fortuna","Nikos Dorado","ENSA","NIKODORADO",null,{"$f":"IF(H415=\"\",\"\",MAX(G$1:G414)+1)","v":""}]
["AG601","Enel Fortuna","Nikos Los Pueblos","ENSA","NIKOPBLOS",null,{"$f":"IF(H416=\"\",\"\",MAX(G$1:G415)+1)","v":""}]
["AG796","Enel Fortuna","Panadería Santa Librada – Zuellen, S.A.","EDEMET","PSLIBRADA",null,{"$f":"IF(H417=\"\",\"\",MAX(G$1:G416)+1)","v":""}]
["AG833","Enel Fortuna","Patronato del Hospital Santo Tomás","EDEMET","GCP0612",null,{"$f":"IF(H418=\"\",\"\",MAX(G$1:G417)+1)","v":""}]
["AG148","Enel Fortuna","Petroterminal de Panamá, S.A. Chiriquí Grande Low","EDECHI","PTPCGL",null,{"$f":"IF(H419=\"\",\"\",MAX(G$1:G418)+1)","v":""}]
["AG149","Enel Fortuna","Petroterminal de Panamá, S.A. Pump Station A","EDECHI","PTPPSA",null,{"$f":"IF(H420=\"\",\"\",MAX(G$1:G419)+1)","v":""}]
["AG150","Enel Fortuna","Petroterminal de Panamá, S.A. Pump Station B","EDECHI","PTPPSB",null,{"$f":"IF(H421=\"\",\"\",MAX(G$1:G420)+1)","v":""}]
["AG549","Enel Fortuna","PH Dream Plaza","ENSA","PHDREAM",null,{"$f":"IF(H422=\"\",\"\",MAX(G$1:G421)+1)","v":""}]
["AG543","Enel Fortuna","PH Grand Tower","EDEMET","GRANDTOWER",null,{"$f":"IF(H423=\"\",\"\",MAX(G$1:G422)+1)","v":""}]
["AG686","Enel Fortuna","PH Los Andes Mall","ENSA","PHLAMALL",null,{"$f":"IF(H424=\"\",\"\",MAX(G$1:G423)+1)","v":""}]
["AG791","Enel Fortuna","PH Plaza del Este","ENSA","PHPESTE",null,{"$f":"IF(H425=\"\",\"\",MAX(G$1:G424)+1)","v":""}]
["AG652","Enel Fortuna","PH Regalia Tower","ENSA","PHREGALIA",null,{"$f":"IF(H426=\"\",\"\",MAX(G$1:G425)+1)","v":""}]
["AG743","Enel Fortuna","Polyenvases S. A","ENSA","POLYENSA",null,{"$f":"IF(H427=\"\",\"\",MAX(G$1:G426)+1)","v":""}]
["AG647","Enel Fortuna","Procesadora industrial de Carnes, S.A.","EDEMET","PROCINDCAR",null,{"$f":"IF(H428=\"\",\"\",MAX(G$1:G427)+1)","v":""}]
["AG276","Enel Fortuna","Procesadora Monte Azul, S.A.","ENSA","MAZUL",null,{"$f":"IF(H429=\"\",\"\",MAX(G$1:G428)+1)","v":""}]
["AG633","Enel Fortuna","Promarina","EDEMET","PROMARINA",null,{"$f":"IF(H430=\"\",\"\",MAX(G$1:G429)+1)","v":""}]
["AG597","Enel Fortuna","Saks Santiago","EDEMET","GPH_SAKSGO",null,{"$f":"IF(H431=\"\",\"\",MAX(G$1:G430)+1)","v":""}]
["AG727","Enel Fortuna","Saks, Vía España","EDEMET","GPH_SAKSVE",null,{"$f":"IF(H432=\"\",\"\",MAX(G$1:G431)+1)","v":""}]
["AG687","Enel Fortuna","SmartFit El Cangrejo","EDEMET","SFITECAN",null,{"$f":"IF(H433=\"\",\"\",MAX(G$1:G432)+1)","v":""}]
["AG688","Enel Fortuna","SmartFit El Dorado","ENSA","SFITEDOR",null,{"$f":"IF(H434=\"\",\"\",MAX(G$1:G433)+1)","v":""}]
["AG090","Enel Fortuna","Sunstar Hotels and Development, S. A.","EDEMET","SUNSTAR",null,{"$f":"IF(H435=\"\",\"\",MAX(G$1:G434)+1)","v":""}]
["AG802","Enel Fortuna","Súper Carnes Aguadulce - Importadora Virzi, S.A.","EDEMET","SCARAG",null,{"$f":"IF(H436=\"\",\"\",MAX(G$1:G435)+1)","v":""}]
["AG801","Enel Fortuna","Súper Carnes Palermo - Importadora Virzi, S.A.","EDEMET","SCARPALE",null,{"$f":"IF(H437=\"\",\"\",MAX(G$1:G436)+1)","v":""}]
["AG617","Enel Fortuna","Taco Bell El Dorado","ENSA","TBELLDOR",null,{"$f":"IF(H438=\"\",\"\",MAX(G$1:G437)+1)","v":""}]
["AG803","Enel Fortuna","The Bristol Hotel, S.A","EDEMET","BRISTOL",null,{"$f":"IF(H439=\"\",\"\",MAX(G$1:G438)+1)","v":""}]
["AG795","Enel Fortuna","The Bristol Resort (Buenaventura)","EDEMET","HBUENAV",null,{"$f":"IF(H440=\"\",\"\",MAX(G$1:G439)+1)","v":""}]
["AG628","Enel Fortuna","The Evolution Hotel Corp.","EDEMET","HOTELW",null,{"$f":"IF(H441=\"\",\"\",MAX(G$1:G440)+1)","v":""}]
["AG629","Enel Fortuna","The Panamera Hotel Corp.","EDEMET","HWALDORF",null,{"$f":"IF(H442=\"\",\"\",MAX(G$1:G441)+1)","v":""}]
["AG625","Enel Fortuna","Universidad Interamericana de Panamá, S. R. L.","ENSA","UIP",null,{"$f":"IF(H443=\"\",\"\",MAX(G$1:G442)+1)","v":""}]
["AG875","Enel Fortuna","Varsovia Trading, Inc.","EDEMET","GCP0642",null,{"$f":"IF(H444=\"\",\"\",MAX(G$1:G443)+1)","v":""}]
["AG728","Enel Fortuna","Vista Pacífica de Oriente","ENSA","VTA_PACIFI",null,{"$f":"IF(H445=\"\",\"\",MAX(G$1:G444)+1)","v":""}]
["AG144","Enel Renovable, S.R.L","Nestle Fabrica de Nata","EDEMET","NESTLENATA",null,{"$f":"IF(H446=\"\",\"\",MAX(G$1:G445)+1)","v":""}]
["AG136","Enel Renovable, S.R.L","Nestle Oficina Central Centroamérica","EDEMET","NESTLELOMA",null,{"$f":"IF(H447=\"\",\"\",MAX(G$1:G446)+1)","v":""}]
["AG259","Enel Renovable, S.R.L","Nestlé Parque Sur","ENSA","NESPSUR",null,{"$f":"IF(H448=\"\",\"\",MAX(G$1:G447)+1)","v":""}]
["AG831","Generación Solar, S. A.","Playa Blanca Hotels Inc.","EDEMET","GCP0610",null,{"$f":"IF(H449=\"\",\"\",MAX(G$1:G448)+1)","v":""}]
["AG778","Generadora del Istmo, S. A.","Agencias Feduro, S.A. Dorado","ENSA","FEDUDOR",null,{"$f":"IF(H450=\"\",\"\",MAX(G$1:G449)+1)","v":""}]
["AG779","Generadora del Istmo, S. A.","Agencias Feduro, S.A. Milla 8","ENSA","FEDUM8",null,{"$f":"IF(H451=\"\",\"\",MAX(G$1:G450)+1)","v":""}]
["AG788","Generadora del Istmo, S. A.","Feduro Aguadulce","EDEMET","FEDUAG",null,{"$f":"IF(H452=\"\",\"\",MAX(G$1:G451)+1)","v":""}]
["AG794","Generadora del Istmo, S. A.","FELIX Multiplaza (Importadora Maduro)","EDEMET","FMPLAZ40",null,{"$f":"IF(H453=\"\",\"\",MAX(G$1:G452)+1)","v":""}]
["AG291","Generadora del Istmo, S. A.","Hospital Santa Fe, S.A.","EDEMET","HSANFE20",null,{"$f":"IF(H454=\"\",\"\",MAX(G$1:G453)+1)","v":""}]
["AG784","Generadora del Istmo, S. A.","Hospitales Nacionales, S.A.","EDEMET","HOSPNAC",null,{"$f":"IF(H455=\"\",\"\",MAX(G$1:G454)+1)","v":""}]
["AG763","Generadora del Istmo, S. A.","Hotel Best Western El Dorado","ENSA","BWESTDO",null,{"$f":"IF(H456=\"\",\"\",MAX(G$1:G455)+1)","v":""}]
["AG949","Generadora del Istmo, S. A.","Hotel Hyatt","EDEMET","GCP0695",null,{"$f":"IF(H457=\"\",\"\",MAX(G$1:G456)+1)","v":""}]
["AG764","Generadora del Istmo, S. A.","Hoteles del Caribe, S.A.","EDEMET","HCARIB",null,{"$f":"IF(H458=\"\",\"\",MAX(G$1:G457)+1)","v":""}]
["AG308","Generadora del Istmo, S. A.","Industrias Lácteas Aguadulce","EDEMET","INDAGUAD",null,{"$f":"IF(H459=\"\",\"\",MAX(G$1:G458)+1)","v":""}]
["AG309","Generadora del Istmo, S. A.","Industrias Lácteas Alanje","EDECHI","INDALANJ",null,{"$f":"IF(H460=\"\",\"\",MAX(G$1:G459)+1)","v":""}]
["AG307","Generadora del Istmo, S. A.","Industrias Lácteas El Espino","EDEMET","INDESPIN",null,{"$f":"IF(H461=\"\",\"\",MAX(G$1:G460)+1)","v":""}]
["AG337","Generadora del Istmo, S. A.","Industrias Lácteas Oficinas Administrativas ","ENSA","INDOFIC",null,{"$f":"IF(H462=\"\",\"\",MAX(G$1:G461)+1)","v":""}]
["AG310","Generadora del Istmo, S. A.","Industrias Lácteas, S.A","ENSA","INDTOC",null,{"$f":"IF(H463=\"\",\"\",MAX(G$1:G462)+1)","v":""}]
["AG765","Generadora del Istmo, S. A.","Industrias Panamá Boston, S.A","EDEMET","PABO",null,{"$f":"IF(H464=\"\",\"\",MAX(G$1:G463)+1)","v":""}]
["AG457","Generadora del Istmo, S. A.","MMDHotel, S.A. - Best Western Hotel","EDEMET","MMDHOTEL",null,{"$f":"IF(H465=\"\",\"\",MAX(G$1:G464)+1)","v":""}]
["AG781","Generadora del Istmo, S. A.","Moldeados Panameños, S.A.","ENSA","MOLPASA",null,{"$f":"IF(H466=\"\",\"\",MAX(G$1:G465)+1)","v":""}]
["AG326","Generadora del Istmo, S. A.","Petite Bottling Company, Inc.","ENSA","PETITEPMA",null,{"$f":"IF(H467=\"\",\"\",MAX(G$1:G466)+1)","v":""}]
["AG557","Generadora del Istmo, S. A.","PH Bicsa Financial Center","EDEMET","BICSA",null,{"$f":"IF(H468=\"\",\"\",MAX(G$1:G467)+1)","v":""}]
["AG785","Generadora del Istmo, S. A.","PH Capital Plaza Business Center","ENSA","CPBCEN31",null,{"$f":"IF(H469=\"\",\"\",MAX(G$1:G468)+1)","v":""}]
["AG558","Generadora del Istmo, S. A.","PH Evolution Tower Corp","EDEMET","EVOLTOW",null,{"$f":"IF(H470=\"\",\"\",MAX(G$1:G469)+1)","v":""}]
["AG814","Generadora del Istmo, S. A.","PH Plaza Credicorp Bank Panamá","EDEMET","CREDIBANK",null,{"$f":"IF(H471=\"\",\"\",MAX(G$1:G470)+1)","v":""}]
["AG787","Generadora del Istmo, S. A.","PH The Point/Miradores At The Point","EDEMET","THEPOINT",null,{"$f":"IF(H472=\"\",\"\",MAX(G$1:G471)+1)","v":""}]
["AG556","Generadora del Istmo, S. A.","PH Torre Panama","ENSA","TORREPMA",null,{"$f":"IF(H473=\"\",\"\",MAX(G$1:G472)+1)","v":""}]
["AG813","Generadora del Istmo, S. A.","PH Torres de Las Américas","EDEMET","TAMERICAS",null,{"$f":"IF(H474=\"\",\"\",MAX(G$1:G473)+1)","v":""}]
["AG217","Generadora del Istmo, S. A.","Planta Jugos del Prado","ENSA","JPRADO",null,{"$f":"IF(H475=\"\",\"\",MAX(G$1:G474)+1)","v":""}]
["AG786","Generadora del Istmo, S. A.","Proserv, S.A.","ENSA","PROSERV97",null,{"$f":"IF(H476=\"\",\"\",MAX(G$1:G475)+1)","v":""}]
["AG387","Generadora del Istmo, S. A.","Reflections Intertrade Corp.","EDEMET","HHINNEX67",null,{"$f":"IF(H477=\"\",\"\",MAX(G$1:G476)+1)","v":""}]
["AG948","Generadora del Istmo, S. A.","Royal Casino","EDEMET","GCP0694",null,{"$f":"IF(H478=\"\",\"\",MAX(G$1:G477)+1)","v":""}]
["AG909","Generadora del Istmo, S. A.","Suez International SAS","ENSA","GCP0663",null,{"$f":"IF(H479=\"\",\"\",MAX(G$1:G478)+1)","v":""}]
["AG218","Generadora del Istmo, S. A.","Taller de Mecánica y Depósitos","ENSA","TMECDEP",null,{"$f":"IF(H480=\"\",\"\",MAX(G$1:G479)+1)","v":""}]
["AG397","Hidro Boquerón, S. A.","Inversiones Meregilda, S.A.","ENSA","INVMEREG",null,{"$f":"IF(H481=\"\",\"\",MAX(G$1:G480)+1)","v":""}]
["AG382","Hidro Boquerón, S. A.","La Coruña Investment, S.A.","ENSA","CORUNA13",null,{"$f":"IF(H482=\"\",\"\",MAX(G$1:G481)+1)","v":""}]
["AG123","Hidro Ibérica, S. A,","Productos Maribel, S.A.","EDEMET","PROCARSA",null,{"$f":"IF(H483=\"\",\"\",MAX(G$1:G482)+1)","v":""}]
["AG931","Hidroecológica del Teribe, S. A.","Corporación Nacional de Envases, S.A.","ENSA","GCP0678",null,{"$f":"IF(H484=\"\",\"\",MAX(G$1:G483)+1)","v":""}]
["AG248","Hidroecológica del Teribe, S. A.","Edificio ENSA Cerro Viento","ENSA","ENSACV",null,{"$f":"IF(H485=\"\",\"\",MAX(G$1:G484)+1)","v":""}]
["AG157","Hidroecológica del Teribe, S. A.","Santa María Business District","ENSA","SMARIABD",null,{"$f":"IF(H486=\"\",\"\",MAX(G$1:G485)+1)","v":""}]
["AG619","Hidroeléctrica San Lorenzo, S.A.","PTP Estación de Bombeo Charco Azul","EDECHI","PTPCAZUL",null,{"$f":"IF(H487=\"\",\"\",MAX(G$1:G486)+1)","v":""}]
["AG930","Hidropiedra, S. A.","Retail Centenario","ENSA","GCP0677",null,{"$f":"IF(H488=\"\",\"\",MAX(G$1:G487)+1)","v":""}]
["AG385","Hydro Caisan, S. A.","Club Unión, S.A.","EDEMET","CUNION20",null,{"$f":"IF(H489=\"\",\"\",MAX(G$1:G488)+1)","v":""}]
["AG177","Hydro Caisan, S. A.","La Prensa, S.A.","EDEMET","LAPRENSA",null,{"$f":"IF(H490=\"\",\"\",MAX(G$1:G489)+1)","v":""}]
["AG723","Ideal Panamá, S. A.","Avipac INC","ENSA","AVIPAC",null,{"$f":"IF(H491=\"\",\"\",MAX(G$1:G490)+1)","v":""}]
["AG320","Ideal Panamá, S. A.","Avipac Inc. Vacamonte","EDEMET","AVIPACVAC",null,{"$f":"IF(H492=\"\",\"\",MAX(G$1:G491)+1)","v":""}]
["AG917","Ideal Panamá, S. A.","Clínica Especializada de Azuero, S.A.","EDEMET","GCP0669",null,{"$f":"IF(H493=\"\",\"\",MAX(G$1:G492)+1)","v":""}]
["AG249","Ideal Panamá, S. A.","Golden Lion Casino","ENSA","GLION",null,{"$f":"IF(H494=\"\",\"\",MAX(G$1:G493)+1)","v":""}]
["AG835","Ideal Panamá, S. A.","Hotel La Compañía","EDEMET","GCP0614",null,{"$f":"IF(H495=\"\",\"\",MAX(G$1:G494)+1)","v":""}]
["AG405","Ideal Panamá, S. A.","Promotora Las Américas Golden Tower, S.A.","EDEMET","PROMGTOWER",null,{"$f":"IF(H496=\"\",\"\",MAX(G$1:G495)+1)","v":""}]
["AG336","Ideal Panamá, S. A.","Santa María Hotel & Golf, S. A.","ENSA","HSMARIA",null,{"$f":"IF(H497=\"\",\"\",MAX(G$1:G496)+1)","v":""}]
["AG250","Ideal Panamá, S. A.","Sortis Hotel","EDEMET","SORTIS",null,{"$f":"IF(H498=\"\",\"\",MAX(G$1:G497)+1)","v":""}]
["AG208","Ideal Panamá, S. A.","Tubotec, S.A.","ENSA","TUBOTEC",null,{"$f":"IF(H499=\"\",\"\",MAX(G$1:G498)+1)","v":""}]
["AG881","Ideal Panamá, S. A.","Waymore Hotel, S. A.","EDEMET","GCP0645",null,{"$f":"IF(H500=\"\",\"\",MAX(G$1:G499)+1)","v":""}]
["AG685","Las Perlas Sur, S. de R. L.","Hotel Hilton Garden Inn","EDEMET","METROHOTEL",null,{"$f":"IF(H501=\"\",\"\",MAX(G$1:G500)+1)","v":""}]
["AG856","Las Perlas Sur, S. de R. L.","Jumbo Market (Cuatro Altos)","ENSA","GCP0629",null,{"$f":"IF(H502=\"\",\"\",MAX(G$1:G501)+1)","v":""}]
["AG858","Las Perlas Sur, S. de R. L.","Sysco Autoservicio, S.A.","ENSA","GCP0631",null,{"$f":"IF(H503=\"\",\"\",MAX(G$1:G502)+1)","v":""}]
["AG328","PAN-AM Generating Limited, S.A.","PH Parque del Mar I","ENSA","PMAR1",null,{"$f":"IF(H504=\"\",\"\",MAX(G$1:G503)+1)","v":""}]
["AG296","Panasolar Generation, S.A.","Luna Brillante","EDEMET","LUNAB",null,{"$f":"IF(H505=\"\",\"\",MAX(G$1:G504)+1)","v":""}]
["AG322","Panasolar Generation, S.A.","Majestic 507, Corp.","EDEMET","MAJESTIC",null,{"$f":"IF(H506=\"\",\"\",MAX(G$1:G505)+1)","v":""}]
["AG271","Panasolar Generation, S.A.","Megapolis","EDEMET","MPOLIS",null,{"$f":"IF(H507=\"\",\"\",MAX(G$1:G506)+1)","v":""}]
["AG774","Panasolar Generation, S.A.","PH Megapolis Outlets Panama","EDEMET","MCENTRO",null,{"$f":"IF(H508=\"\",\"\",MAX(G$1:G507)+1)","v":""}]
["AG254","Panasolar Generation, S.A.","PH Oceanía Business Plaza Torre","EDEMET","OCEANIA",null,{"$f":"IF(H509=\"\",\"\",MAX(G$1:G508)+1)","v":""}]
["AG295","Panasolar Generation, S.A.","PH Sortis Business Tower","EDEMET","SORTIS3",null,{"$f":"IF(H510=\"\",\"\",MAX(G$1:G509)+1)","v":""}]
["AG698","PSZ1, S. A.","Casino Hotel La Hacienda (Santiago)","EDEMET","CAVAGAM",null,{"$f":"IF(H511=\"\",\"\",MAX(G$1:G510)+1)","v":""}]
["AG611","PSZ1, S. A.","Colón Container Terminal 13","ENSA","CCONTAIN13",null,{"$f":"IF(H512=\"\",\"\",MAX(G$1:G511)+1)","v":""}]
["AG612","PSZ1, S. A.","Colón Container Terminal 2","ENSA","CCONTAIN2",null,{"$f":"IF(H513=\"\",\"\",MAX(G$1:G512)+1)","v":""}]
["AG699","PSZ1, S. A.","Conway Albrook","EDEMET","CONWAYAL",null,{"$f":"IF(H514=\"\",\"\",MAX(G$1:G513)+1)","v":""}]
["AG700","PSZ1, S. A.","Conway Los Pueblos","ENSA","CONWAYLPB",null,{"$f":"IF(H515=\"\",\"\",MAX(G$1:G514)+1)","v":""}]
["AG701","PSZ1, S. A.","Conway Multicentro","EDEMET","CONWAYMC",null,{"$f":"IF(H516=\"\",\"\",MAX(G$1:G515)+1)","v":""}]
["AG702","PSZ1, S. A.","Conway Westland","EDEMET","CONWAYWL",null,{"$f":"IF(H517=\"\",\"\",MAX(G$1:G516)+1)","v":""}]
["AG599","PSZ1, S. A.","Farallón Aquaculture Vacamonte","EDEMET","FARACVAC",null,{"$f":"IF(H518=\"\",\"\",MAX(G$1:G517)+1)","v":""}]
["AG582","PSZ1, S. A.","Glaxosmithkline Panamá","ENSA","GSK_JDIAZ",null,{"$f":"IF(H519=\"\",\"\",MAX(G$1:G518)+1)","v":""}]
["AG607","PSZ1, S. A.","Tribunal Electoral","EDEMET","TELECTOR",null,{"$f":"IF(H520=\"\",\"\",MAX(G$1:G519)+1)","v":""}]
["AG214","Tecnisol I, S.A.","Clínica Hospital San Fernando, S.A.","EDEMET","CHSF",null,{"$f":"IF(H521=\"\",\"\",MAX(G$1:G520)+1)","v":""}]
["AG312","Tecnisol I, S.A.","Coca Cola Femsa, S.A","ENSA","PECCOLA63",null,{"$f":"IF(H522=\"\",\"\",MAX(G$1:G521)+1)","v":""}]
["AG758","Tecnisol I, S.A.","Petrolera Nacional Antón","EDEMET","TERPELANT",null,{"$f":"IF(H523=\"\",\"\",MAX(G$1:G522)+1)","v":""}]
["AG757","Tecnisol I, S.A.","Petrolera Nacional Autopista Colón","ENSA","TERPELCOL",null,{"$f":"IF(H524=\"\",\"\",MAX(G$1:G523)+1)","v":""}]
["AG753","Tecnisol I, S.A.","Petrolera Nacional Chorrera","EDEMET","TERPELCHO",null,{"$f":"IF(H525=\"\",\"\",MAX(G$1:G524)+1)","v":""}]
["AG754","Tecnisol I, S.A.","Petrolera Nacional Coronado","EDEMET","TERPELCOR",null,{"$f":"IF(H526=\"\",\"\",MAX(G$1:G525)+1)","v":""}]
["AG755","Tecnisol I, S.A.","Petrolera Nacional Penonomé","EDEMET","TERPELPEN",null,{"$f":"IF(H527=\"\",\"\",MAX(G$1:G526)+1)","v":""}]
["AG756","Tecnisol I, S.A.","Petrolera Nacional Santiago","EDEMET","TERPELSTG",null,{"$f":"IF(H528=\"\",\"\",MAX(G$1:G527)+1)","v":""}]
["AG182","Tecnisol I, S.A.","Planta Embotelladora Coca Cola 01","ENSA","PECCOLA06",null,{"$f":"IF(H529=\"\",\"\",MAX(G$1:G528)+1)","v":""}]
["AG181","Tecnisol I, S.A.","Planta Embotelladora Coca Cola 02","ENSA","PECCOLA51",null,{"$f":"IF(H530=\"\",\"\",MAX(G$1:G529)+1)","v":""}]
["AG829","Tecnisol I, S.A.","Princess Hotel Panamá","EDEMET","GCP0608",null,{"$f":"IF(H531=\"\",\"\",MAX(G$1:G530)+1)","v":""}]
["AG315","Tecnisol I, S.A.","Ventas y Mercadeo Panama, S.A.","ENSA","VMERCA",null,{"$f":"IF(H532=\"\",\"\",MAX(G$1:G531)+1)","v":""}]
["AG673","Tecnisol II, S.A.","Cable Onda IDC Divisa","EDEMET","COIDCDIV",null,{"$f":"IF(H533=\"\",\"\",MAX(G$1:G532)+1)","v":""}]
["AG131","Tecnisol II, S.A.","Cable Onda, S. A.","EDEMET","CABLEONDA",null,{"$f":"IF(H534=\"\",\"\",MAX(G$1:G533)+1)","v":""}]
["AG178","Tecnisol II, S.A.","Cable Onda 12 de Octubre","ENSA","CONDA12OC",null,{"$f":"IF(H535=\"\",\"\",MAX(G$1:G534)+1)","v":""}]
["AG190","Tecnisol II, S.A.","Hotel Torres de Alba","EDEMET","TORREALBA",null,{"$f":"IF(H536=\"\",\"\",MAX(G$1:G535)+1)","v":""}]
["AG566","Tecnisol II, S.A.","Hotelera RH, S.A.","EDEMET","HPBLANCA",null,{"$f":"IF(H537=\"\",\"\",MAX(G$1:G536)+1)","v":""}]
["AG210","Tecnisol II, S.A.","Macello, S. A.","ENSA","MACELLO",null,{"$f":"IF(H538=\"\",\"\",MAX(G$1:G537)+1)","v":""}]
["AG290","Tecnisol II, S.A.","PH Multiplaza Pacific","EDEMET","MPLAZA",null,{"$f":"IF(H539=\"\",\"\",MAX(G$1:G538)+1)","v":""}]
["AG916","Tecnisol II, S.A.","Telecomunicaciones Digitales, S.A. (Chorrera)","EDEMET","GCP0668",null,{"$f":"IF(H540=\"\",\"\",MAX(G$1:G539)+1)","v":""}]
["AG681","Tecnisol II, S.A.","Telefónica Móviles Obarrio BOC ","EDEMET","TELEBOB",null,{"$f":"IF(H541=\"\",\"\",MAX(G$1:G540)+1)","v":""}]
["AG871","Tecnisol II, S.A.","TowerBank International, Inc. (Calle 50)","EDEMET","GCP0640",null,{"$f":"IF(H542=\"\",\"\",MAX(G$1:G541)+1)","v":""}]
["AG565","Tecnisol II, S.A.","Urban Developments, S.A.","EDEMET","HRIU",null,{"$f":"IF(H543=\"\",\"\",MAX(G$1:G542)+1)","v":""}]
["AG265","Tecnisol III, S.A.","Delirys Bella Vista","EDEMET","DELYRBVTA",null,{"$f":"IF(H544=\"\",\"\",MAX(G$1:G543)+1)","v":""}]
["AG340","Tecnisol III, S.A.","Ice Gaming Corporation","EDEMET","ICEGAMING",null,{"$f":"IF(H545=\"\",\"\",MAX(G$1:G544)+1)","v":""}]
["AG865","Tecnisol III, S.A.","Súper Riba Smith Albrook","EDEMET","GCP0637",null,{"$f":"IF(H546=\"\",\"\",MAX(G$1:G545)+1)","v":""}]
["AG306","Tecnisol III, S.A.","Súper Riba Smith Alta Plaza","ENSA","RSAPLAZA",null,{"$f":"IF(H547=\"\",\"\",MAX(G$1:G546)+1)","v":""}]
["AG266","Tecnisol III, S.A.","Súper Riba Smith Bella Vista","EDEMET","RSBVISTA",null,{"$f":"IF(H548=\"\",\"\",MAX(G$1:G547)+1)","v":""}]
["AG223","Tecnisol III, S.A.","Súper Riba Smith Brisas del Golf","ENSA","RSBGOLF",null,{"$f":"IF(H549=\"\",\"\",MAX(G$1:G548)+1)","v":""}]
["AG263","Tecnisol III, S.A.","Súper Riba Smith Chitré","EDEMET","RSCHITRE",null,{"$f":"IF(H550=\"\",\"\",MAX(G$1:G549)+1)","v":""}]
["AG262","Tecnisol III, S.A.","Súper Riba Smith Coronado","EDEMET","RSCORONA",null,{"$f":"IF(H551=\"\",\"\",MAX(G$1:G550)+1)","v":""}]
["AG221","Tecnisol III, S.A.","Súper Riba Smith Costa del Este","ENSA","RSCESTE",null,{"$f":"IF(H552=\"\",\"\",MAX(G$1:G551)+1)","v":""}]
["AG261","Tecnisol III, S.A.","Súper Riba Smith Howard Panamá Pacífico","EDEMET","RSHOWARD",null,{"$f":"IF(H553=\"\",\"\",MAX(G$1:G552)+1)","v":""}]
["AG219","Tecnisol III, S.A.","Súper Riba Smith La Pita","EDEMET","RSPITA",null,{"$f":"IF(H554=\"\",\"\",MAX(G$1:G553)+1)","v":""}]
["AG260","Tecnisol III, S.A.","Súper Riba Smith Multiplaza","EDEMET","RSMPLAZA",null,{"$f":"IF(H555=\"\",\"\",MAX(G$1:G554)+1)","v":""}]
["AG264","Tecnisol III, S.A.","Súper Riba Smith Plaza Market","EDEMET","RSMARKET",null,{"$f":"IF(H556=\"\",\"\",MAX(G$1:G555)+1)","v":""}]
["AG220","Tecnisol III, S.A.","Súper Riba Smith Transistmica","EDEMET","RSTRANS",null,{"$f":"IF(H557=\"\",\"\",MAX(G$1:G556)+1)","v":""}]
["AG704","Tecnisol III, S.A.","Súper Riba Smith Versalles","ENSA","RSVERSAL",null,{"$f":"IF(H558=\"\",\"\",MAX(G$1:G557)+1)","v":""}]
["AG321","Tecnisol III, S.A.","The Iron Tower, Corp.","EDEMET","IRONTOWER",null,{"$f":"IF(H559=\"\",\"\",MAX(G$1:G558)+1)","v":""}]
[null,null,null,null,null,null,{"$f":"IF(H560=\"\",\"\",MAX(G$1:G559)+1)","v":""}]
[null,null,null,null,null,null,{"$f":"IF(H561=\"\",\"\",MAX(G$1:G560)+1)","v":""}]
[null,null,null,null,null,null,{"$f":"IF(H562=\"\",\"\",MAX(G$1:G561)+1)","v":""}]
[null,null,null,null,null,null,{"$f":"IF(H563=\"\",\"\",MAX(G$1:G562)+1)","v":""}]
[null,null,null,null,null,null,{"$f":"IF(H564=\"\",\"\",MAX(G$1:G563)+1)","v":""}]
[null,null,null,null,null,null,{"$f":"IF(H565=\"\",\"\",MAX(G$1:G564)+1)","v":""}]
[null,null,null,null,null,null,{"$f":"IF(H566=\"\",\"\",MAX(G$1:G565)+1)","v":""}]
[null,null,null,null,null,null,{"$f":"IF(H567=\"\",\"\",MAX(G$1:G566)+1)","v":""}]
[null,null,null,null,null,null,{"$f":"IF(H568=\"\",\"\",MAX(G$1:G567)+1)","v":""}]
[null,null,null,null,null,null,{"$f":"IF(H569=\"\",\"\",MAX(G$1:G568)+1)","v":""}]
[null,null,null,null,null,null,{"$f":"IF(H570=\"\",\"\",MAX(G$1:G569)+1)","v":""}]
[null,null,null,null,null,null,{"$f":"IF(H571=\"\",\"\",MAX(G$1:G570)+1)","v":""}]
[null,null,null,null,null,null,{"$f":"IF(H572=\"\",\"\",MAX(G$1:G571)+1)","v":""}]
[null,null,null,null,null,null,{"$f":"IF(H573=\"\",\"\",MAX(G$1:G572)+1)","v":""}]
[null,null,null,null,null,null,{"$f":"IF(H574=\"\",\"\",MAX(G$1:G573)+1)","v":""}]
[null,null,null,null,null,null,{"$f":"IF(H575=\"\",\"\",MAX(G$1:G574)+1)","v":""}]
[null,null,null,null,null,null,{"$f":"IF(H576=\"\",\"\",MAX(G$1:G575)+1)","v":""}]
[null,null,null,null,null,null,{"$f":"IF(H577=\"\",\"\",MAX(G$1:G576)+1)","v":""}]
[null,null,null,null,null,null,{"$f":"IF(H578=\"\",\"\",MAX(G$1:G577)+1)","v":""}]
[null,null,null,null,null,null,{"$f":"IF(H579=\"\",\"\",MAX(G$1:G578)+1)","v":""}]
[null,null,null,null,null,null,{"$f":"IF(H580=\"\",\"\",MAX(G$1:G579)+1)","v":""}]
[null,null,null,null,null,null,{"$f":"IF(H581=\"\",\"\",MAX(G$1:G580)+1)","v":""}]
[null,null,null,null,null,null,{"$f":"IF(H582=\"\",\"\",MAX(G$1:G581)+1)","v":""}]
[null,null,null,null,null,null,{"$f":"IF(H583=\"\",\"\",MAX(G$1:G582)+1)","v":""}]
[null,null,null,null,null,null,{"$f":"IF(H584=\"\",\"\",MAX(G$1:G583)+1)","v":""}]
[null,null,null,null,null,null,{"$f":"IF(H585=\"\",\"\",MAX(G$1:G584)+1)","v":""}]
[null,null,null,null,null,null,{"$f":"IF(H586=\"\",\"\",MAX(G$1:G585)+1)","v":""}]
[null,null,null,null,null,null,{"$f":"IF(H587=\"\",\"\",MAX(G$1:G586)+1)","v":""}]
[null,null,null,null,null,null,{"$f":"IF(H588=\"\",\"\",MAX(G$1:G587)+1)","v":""}]
[null,null,null,null,null,null,{"$f":"IF(H589=\"\",\"\",MAX(G$1:G588)+1)","v":""}]
[null,null,null,null,null,null,{"$f":"IF(H590=\"\",\"\",MAX(G$1:G589)+1)","v":""}]
[null,null,null,null,null,null,{"$f":"IF(H591=\"\",\"\",MAX(G$1:G590)+1)","v":""}]
[null,null,null,null,null,null,{"$f":"IF(H592=\"\",\"\",MAX(G$1:G591)+1)","v":""}]
[null,null,null,null,null,null,{"$f":"IF(H593=\"\",\"\",MAX(G$1:G592)+1)","v":""}]
[null,null,null,null,null,null,{"$f":"IF(H594=\"\",\"\",MAX(G$1:G593)+1)","v":""}]
[null,null,null,null,null,null,{"$f":"IF(H595=\"\",\"\",MAX(G$1:G594)+1)","v":""}]
[null,null,null,null,null,null,{"$f":"IF(H596=\"\",\"\",MAX(G$1:G595)+1)","v":""}]
[null,null,null,null,null,null,{"$f":"IF(H597=\"\",\"\",MAX(G$1:G596)+1)","v":""}]
[null,null,null,null,null,null,{"$f":"IF(H598=\"\",\"\",MAX(G$1:G597)+1)","v":""}]
[null,null,null,null,null,null,{"$f":"IF(H599=\"\",\"\",MAX(G$1:G598)+1)","v":""}]
[null,null,null,null,null,null,{"$f":"IF(H600=\"\",\"\",MAX(G$1:G599)+1)","v":""}]
[null,null,null,null,null,null,{"$f":"IF(H601=\"\",\"\",MAX(G$1:G600)+1)","v":""}]
[null,null,null,null,null,null,{"$f":"IF(H602=\"\",\"\",MAX(G$1:G601)+1)","v":""}]
[null,null,null,null,null,null,{"$f":"IF(H603=\"\",\"\",MAX(G$1:G602)+1)","v":""}]
[null,null,null,null,null,null,{"$f":"IF(H604=\"\",\"\",MAX(G$1:G603)+1)","v":""}]
[null,null,null,null,null,null,{"$f":"IF(H605=\"\",\"\",MAX(G$1:G604)+1)","v":""}]
[null,null,null,null,null,null,{"$f":"IF(H606=\"\",\"\",MAX(G$1:G605)+1)","v":""}]
[null,null,null,null,null,null,{"$f":"IF(H607=\"\",\"\",MAX(G$1:G606)+1)","v":""}]
[null,null,null,null,null,null,{"$f":"IF(H608=\"\",\"\",MAX(G$1:G607)+1)","v":""}]
[]
[null,null,null,null,null,null,{"$f":"IF(H610=\"\",\"\",MAX(G$1:G608)+1)","v":""}]
[null,null,null,null,null,null,{"$f":"IF(H611=\"\",\"\",MAX(G$1:G610)+1)","v":""}]
[]
[null,null,null,null,null,null,{"$f":"IF(H613=\"\",\"\",MAX(G$1:G611)+1)","v":""}]
[null,null,null,null,null,null,{"$f":"IF(H614=\"\",\"\",MAX(G$1:G613)+1)","v":""}]
[null,null,null,null,null,null,{"$f":"IF(H615=\"\",\"\",MAX(G$1:G614)+1)","v":""}]
[null,null,null,null,null,null,{"$f":"IF(H616=\"\",\"\",MAX(G$1:G615)+1)","v":""}]
[null,null,null,null,null,null,{"$f":"IF(H617=\"\",\"\",MAX(G$1:G616)+1)","v":""}]
[null,null,null,null,null,null,{"$f":"IF(H618=\"\",\"\",MAX(G$1:G617)+1)","v":""}]
[null,null,null,null,null,null,{"$f":"IF(H619=\"\",\"\",MAX(G$1:G618)+1)","v":""}]
[null,null,null,null,null,null,{"$f":"IF(H620=\"\",\"\",MAX(G$1:G619)+1)","v":""}]
[null,null,null,null,null,null,{"$f":"IF(H621=\"\",\"\",MAX(G$1:G620)+1)","v":""}]
[null,null,null,null,null,null,{"$f":"IF(H622=\"\",\"\",MAX(G$1:G621)+1)","v":""}]
[null,null,null,null,null,null,{"$f":"IF(H623=\"\",\"\",MAX(G$1:G622)+1)","v":""}]
[null,null,null,null,null,null,{"$f":"IF(H624=\"\",\"\",MAX(G$1:G623)+1)","v":""}]
[null,null,null,null,null,null,{"$f":"IF(H625=\"\",\"\",MAX(G$1:G624)+1)","v":""}]
[null,null,null,null,null,null,{"$f":"IF(H626=\"\",\"\",MAX(G$1:G625)+1)","v":""}]
[null,null,null,null,null,null,{"$f":"IF(H627=\"\",\"\",MAX(G$1:G626)+1)","v":""}]
[null,null,null,null,null,null,{"$f":"IF(H628=\"\",\"\",MAX(G$1:G627)+1)","v":""}]
[null,null,null,null,null,null,{"$f":"IF(H629=\"\",\"\",MAX(G$1:G628)+1)","v":""}]
[null,null,null,null,null,null,{"$f":"IF(H630=\"\",\"\",MAX(G$1:G629)+1)","v":""}]
[null,null,null,null,null,null,{"$f":"IF(H631=\"\",\"\",MAX(G$1:G630)+1)","v":""}]
[null,null,null,null,null,null,{"$f":"IF(H632=\"\",\"\",MAX(G$1:G631)+1)","v":""}]
[null,null,null,null,null,null,{"$f":"IF(H633=\"\",\"\",MAX(G$1:G632)+1)","v":""}]
[null,null,null,null,null,null,{"$f":"IF(H634=\"\",\"\",MAX(G$1:G633)+1)","v":""}]
[null,null,null,null,null,null,{"$f":"IF(H635=\"\",\"\",MAX(G$1:G634)+1)","v":""}]
[null,null,null,null,null,null,{"$f":"IF(H636=\"\",\"\",MAX(G$1:G635)+1)","v":""}]
[null,null,null,null,null,null,{"$f":"IF(H637=\"\",\"\",MAX(G$1:G636)+1)","v":""}]
[null,null,null,null,null,null,{"$f":"IF(H638=\"\",\"\",MAX(G$1:G637)+1)","v":""}]
[null,null,null,null,null,null,{"$f":"IF(H639=\"\",\"\",MAX(G$1:G638)+1)","v":""}]
[null,null,null,null,null,null,{"$f":"IF(H640=\"\",\"\",MAX(G$1:G639)+1)","v":""}]
[null,null,null,null,null,null,{"$f":"IF(H641=\"\",\"\",MAX(G$1:G640)+1)","v":""}]
[null,null,null,null,null,null,{"$f":"IF(H642=\"\",\"\",MAX(G$1:G641)+1)","v":""}]
[null,null,null,null,null,null,{"$f":"IF(H643=\"\",\"\",MAX(G$1:G642)+1)","v":""}]
[null,null,null,null,null,null,{"$f":"IF(H644=\"\",\"\",MAX(G$1:G643)+1)","v":""}]
[null,null,null,null,null,null,{"$f":"IF(H645=\"\",\"\",MAX(G$1:G644)+1)","v":""}]
[null,null,null,null,null,null,{"$f":"IF(H646=\"\",\"\",MAX(G$1:G645)+1)","v":""}]
[null,null,null,null,null,null,{"$f":"IF(H647=\"\",\"\",MAX(G$1:G646)+1)","v":""}]
[null,null,null,null,null,null,{"$f":"IF(H648=\"\",\"\",MAX(G$1:G647)+1)","v":""}]
[null,null,null,null,null,null,{"$f":"IF(H649=\"\",\"\",MAX(G$1:G648)+1)","v":""}]
[null,null,null,null,null,null,{"$f":"IF(H650=\"\",\"\",MAX(G$1:G649)+1)","v":""}]
[null,null,null,null,null,null,{"$f":"IF(H651=\"\",\"\",MAX(G$1:G650)+1)","v":""}]
[null,null,null,null,null,null,{"$f":"IF(H652=\"\",\"\",MAX(G$1:G651)+1)","v":""}]
[null,null,null,null,null,null,{"$f":"IF(H653=\"\",\"\",MAX(G$1:G652)+1)","v":""}]
[null,null,null,null,null,null,{"$f":"IF(H654=\"\",\"\",MAX(G$1:G653)+1)","v":""}]
[null,null,null,null,null,null,{"$f":"IF(H655=\"\",\"\",MAX(G$1:G654)+1)","v":""}]
[null,null,null,null,null,null,{"$f":"IF(H656=\"\",\"\",MAX(G$1:G655)+1)","v":""}]
[null,null,null,null,null,null,{"$f":"IF(H657=\"\",\"\",MAX(G$1:G656)+1)","v":""}]
[null,null,null,null,null,null,{"$f":"IF(H658=\"\",\"\",MAX(G$1:G657)+1)","v":""}]
[null,null,null,null,null,null,{"$f":"IF(H659=\"\",\"\",MAX(G$1:G658)+1)","v":""}]
[null,null,null,null,null,null,{"$f":"IF(H660=\"\",\"\",MAX(G$1:G659)+1)","v":""}]
[null,null,null,null,null,null,{"$f":"IF(H661=\"\",\"\",MAX(G$1:G660)+1)","v":""}]
[null,null,null,null,null,null,{"$f":"IF(H662=\"\",\"\",MAX(G$1:G661)+1)","v":""}]
[null,null,null,null,null,null,{"$f":"IF(H663=\"\",\"\",MAX(G$1:G662)+1)","v":""}]
[null,null,null,null,null,null,{"$f":"IF(H664=\"\",\"\",MAX(G$1:G663)+1)","v":""}]
[null,null,null,null,null,null,{"$f":"IF(H665=\"\",\"\",MAX(G$1:G664)+1)","v":""}]
[null,null,null,null,null,null,{"$f":"IF(H666=\"\",\"\",MAX(G$1:G665)+1)","v":""}]
[null,null,null,null,null,null,{"$f":"IF(H667=\"\",\"\",MAX(G$1:G666)+1)","v":""}]
[null,null,null,null,null,null,{"$f":"IF(H668=\"\",\"\",MAX(G$1:G667)+1)","v":""}]
[null,null,null,null,null,null,{"$f":"IF(H669=\"\",\"\",MAX(G$1:G668)+1)","v":""}]
[null,null,null,null,null,null,{"$f":"IF(H670=\"\",\"\",MAX(G$1:G669)+1)","v":""}]
[null,null,null,null,null,null,{"$f":"IF(H671=\"\",\"\",MAX(G$1:G670)+1)","v":""}]
[null,null,null,null,null,null,{"$f":"IF(H672=\"\",\"\",MAX(G$1:G671)+1)","v":""}]
[null,null,null,null,null,null,{"$f":"IF(H673=\"\",\"\",MAX(G$1:G672)+1)","v":""}]
[null,null,null,null,null,null,{"$f":"IF(H674=\"\",\"\",MAX(G$1:G673)+1)","v":""}]
[null,null,null,null,null,null,{"$f":"IF(H675=\"\",\"\",MAX(G$1:G674)+1)","v":""}]
[null,null,null,null,null,null,{"$f":"IF(H676=\"\",\"\",MAX(G$1:G675)+1)","v":""}]
[null,null,null,null,null,null,{"$f":"IF(H677=\"\",\"\",MAX(G$1:G676)+1)","v":""}]
[null,null,null,null,null,null,{"$f":"IF(H678=\"\",\"\",MAX(G$1:G677)+1)","v":""}]
[null,null,null,null,null,null,{"$f":"IF(H679=\"\",\"\",MAX(G$1:G678)+1)","v":""}]
[null,null,null,null,null,null,{"$f":"IF(H680=\"\",\"\",MAX(G$1:G679)+1)","v":""}]
[null,null,null,null,null,null,{"$f":"IF(H681=\"\",\"\",MAX(G$1:G680)+1)","v":""}]
[null,null,null,null,null,null,{"$f":"IF(H682=\"\",\"\",MAX(G$1:G681)+1)","v":""}]
[null,null,null,null,null,null,{"$f":"IF(H683=\"\",\"\",MAX(G$1:G682)+1)","v":""}]
[null,null,null,null,null,null,{"$f":"IF(H684=\"\",\"\",MAX(G$1:G683)+1)","v":""}]
[null,null,null,null,null,null,{"$f":"IF(H685=\"\",\"\",MAX(G$1:G684)+1)","v":""}]
[null,null,null,null,null,null,{"$f":"IF(H686=\"\",\"\",MAX(G$1:G685)+1)","v":""}]
[null,null,null,null,null,null,{"$f":"IF(H687=\"\",\"\",MAX(G$1:G686)+1)","v":""}]
[null,null,null,null,null,null,{"$f":"IF(H688=\"\",\"\",MAX(G$1:G687)+1)","v":""}]
[null,null,null,null,null,null,{"$f":"IF(H689=\"\",\"\",MAX(G$1:G688)+1)","v":""}]
[null,null,null,null,null,null,{"$f":"IF(H690=\"\",\"\",MAX(G$1:G689)+1)","v":""}]
[null,null,null,null,null,null,{"$f":"IF(H691=\"\",\"\",MAX(G$1:G690)+1)","v":""}]
[null,null,null,null,null,null,{"$f":"IF(H692=\"\",\"\",MAX(G$1:G691)+1)","v":""}]
[null,null,null,null,null,null,{"$f":"IF(H693=\"\",\"\",MAX(G$1:G692)+1)","v":""}]
[null,null,null,null,null,null,{"$f":"IF(H694=\"\",\"\",MAX(G$1:G693)+1)","v":""}]
[null,null,null,null,null,null,{"$f":"IF(H695=\"\",\"\",MAX(G$1:G694)+1)","v":""}]
[null,null,null,null,null,null,{"$f":"IF(H696=\"\",\"\",MAX(G$1:G695)+1)","v":""}]
[null,null,null,null,null,null,{"$f":"IF(H697=\"\",\"\",MAX(G$1:G696)+1)","v":""}]
[null,null,null,null,null,null,{"$f":"IF(H698=\"\",\"\",MAX(G$1:G697)+1)","v":""}]
[null,null,null,null,null,null,{"$f":"IF(H699=\"\",\"\",MAX(G$1:G698)+1)","v":""}]
[null,null,null,null,null,null,{"$f":"IF(H700=\"\",\"\",MAX(G$1:G699)+1)","v":""}]
[null,null,null,null,null,null,{"$f":"IF(H701=\"\",\"\",MAX(G$1:G700)+1)","v":""}]
[null,null,null,null,null,null,{"$f":"IF(H702=\"\",\"\",MAX(G$1:G701)+1)","v":""}]
[null,null,null,null,null,null,{"$f":"IF(H703=\"\",\"\",MAX(G$1:G702)+1)","v":""}]
[null,null,null,null,null,null,{"$f":"IF(H704=\"\",\"\",MAX(G$1:G703)+1)","v":""}]
[null,null,null,null,null,null,{"$f":"IF(H705=\"\",\"\",MAX(G$1:G704)+1)","v":""}]
[null,null,null,null,null,null,{"$f":"IF(H706=\"\",\"\",MAX(G$1:G705)+1)","v":""}]
[null,null,null,null,null,null,{"$f":"IF(H707=\"\",\"\",MAX(G$1:G706)+1)","v":""}]
[null,null,null,null,null,null,{"$f":"IF(H708=\"\",\"\",MAX(G$1:G707)+1)","v":""}]
[null,null,null,null,null,null,{"$f":"IF(H709=\"\",\"\",MAX(G$1:G708)+1)","v":""}]
[null,null,null,null,null,null,{"$f":"IF(H710=\"\",\"\",MAX(G$1:G709)+1)","v":""}]
[null,null,null,null,null,null,{"$f":"IF(H711=\"\",\"\",MAX(G$1:G710)+1)","v":""}]
[null,null,null,null,null,null,{"$f":"IF(H712=\"\",\"\",MAX(G$1:G711)+1)","v":""}]
[null,null,null,null,null,null,{"$f":"IF(H713=\"\",\"\",MAX(G$1:G712)+1)","v":""}]
[null,null,null,null,null,null,{"$f":"IF(H714=\"\",\"\",MAX(G$1:G713)+1)","v":""}]
[null,null,null,null,null,null,{"$f":"IF(H715=\"\",\"\",MAX(G$1:G714)+1)","v":""}]
[null,null,null,null,null,null,{"$f":"IF(H716=\"\",\"\",MAX(G$1:G715)+1)","v":""}]
[null,null,null,null,null,null,{"$f":"IF(H717=\"\",\"\",MAX(G$1:G716)+1)","v":""}]
[null,null,null,null,null,null,{"$f":"IF(H718=\"\",\"\",MAX(G$1:G717)+1)","v":""}]
[null,null,null,null,null,null,{"$f":"IF(H719=\"\",\"\",MAX(G$1:G718)+1)","v":""}]
[null,null,null,null,null,null,{"$f":"IF(H720=\"\",\"\",MAX(G$1:G719)+1)","v":""}]
[null,null,null,null,null,null,{"$f":"IF(H721=\"\",\"\",MAX(G$1:G720)+1)","v":""}]
[null,null,null,null,null,null,{"$f":"IF(H722=\"\",\"\",MAX(G$1:G721)+1)","v":""}]
[null,null,null,null,null,null,{"$f":"IF(H723=\"\",\"\",MAX(G$1:G722)+1)","v":""}]
[null,null,null,null,null,null,{"$f":"IF(H724=\"\",\"\",MAX(G$1:G723)+1)","v":""}]
[null,null,null,null,null,null,{"$f":"IF(H725=\"\",\"\",MAX(G$1:G724)+1)","v":""}]
[null,null,null,null,null,null,{"$f":"IF(H726=\"\",\"\",MAX(G$1:G725)+1)","v":""}]
[null,null,null,null,null,null,{"$f":"IF(H727=\"\",\"\",MAX(G$1:G726)+1)","v":""}]
[null,null,null,null,null,null,{"$f":"IF(H728=\"\",\"\",MAX(G$1:G727)+1)","v":""}]
[null,null,null,null,null,null,{"$f":"IF(H729=\"\",\"\",MAX(G$1:G728)+1)","v":""}]
[null,null,null,null,null,null,{"$f":"IF(H730=\"\",\"\",MAX(G$1:G729)+1)","v":""}]
[null,null,null,null,null,null,{"$f":"IF(H731=\"\",\"\",MAX(G$1:G730)+1)","v":""}]
[null,null,null,null,null,null,{"$f":"IF(H732=\"\",\"\",MAX(G$1:G731)+1)","v":""}]
[null,null,null,null,null,null,{"$f":"IF(H733=\"\",\"\",MAX(G$1:G732)+1)","v":""}]
[null,null,null,null,null,null,{"$f":"IF(H734=\"\",\"\",MAX(G$1:G733)+1)","v":""}]
[null,null,null,null,null,null,{"$f":"IF(H735=\"\",\"\",MAX(G$1:G734)+1)","v":""}]
[null,null,null,null,null,null,{"$f":"IF(H736=\"\",\"\",MAX(G$1:G735)+1)","v":""}]
[null,null,null,null,null,null,{"$f":"IF(H737=\"\",\"\",MAX(G$1:G736)+1)","v":""}]
[null,null,null,null,null,null,{"$f":"IF(H738=\"\",\"\",MAX(G$1:G737)+1)","v":""}]
[null,null,null,null,null,null,{"$f":"IF(H739=\"\",\"\",MAX(G$1:G738)+1)","v":""}]
[null,null,null,null,null,null,{"$f":"IF(H740=\"\",\"\",MAX(G$1:G739)+1)","v":""}]
[null,null,null,null,null,null,{"$f":"IF(H741=\"\",\"\",MAX(G$1:G740)+1)","v":""}]
[null,null,null,null,null,null,{"$f":"IF(H742=\"\",\"\",MAX(G$1:G741)+1)","v":""}]
[null,null,null,null,null,null,{"$f":"IF(H743=\"\",\"\",MAX(G$1:G742)+1)","v":""}]
[null,null,null,null,null,null,{"$f":"IF(H744=\"\",\"\",MAX(G$1:G743)+1)","v":""}]
[null,null,null,null,null,null,{"$f":"IF(H745=\"\",\"\",MAX(G$1:G744)+1)","v":""}]
[null,null,null,null,null,null,{"$f":"IF(H746=\"\",\"\",MAX(G$1:G745)+1)","v":""}]
[null,null,null,null,null,null,{"$f":"IF(H747=\"\",\"\",MAX(G$1:G746)+1)","v":""}]
[null,null,null,null,null,null,{"$f":"IF(H748=\"\",\"\",MAX(G$1:G747)+1)","v":""}]
[null,null,null,null,null,null,{"$f":"IF(H749=\"\",\"\",MAX(G$1:G748)+1)","v":""}]
[null,null,null,null,null,null,{"$f":"IF(H750=\"\",\"\",MAX(G$1:G749)+1)","v":""}]
[null,null,null,null,null,null,{"$f":"IF(H751=\"\",\"\",MAX(G$1:G750)+1)","v":""}]
[null,null,null,null,null,null,{"$f":"IF(H752=\"\",\"\",MAX(G$1:G751)+1)","v":""}]
[null,null,null,null,null,null,{"$f":"IF(H753=\"\",\"\",MAX(G$1:G752)+1)","v":""}]
[null,null,null,null,null,null,{"$f":"IF(H754=\"\",\"\",MAX(G$1:G753)+1)","v":""}]
[null,null,null,null,null,null,{"$f":"IF(H755=\"\",\"\",MAX(G$1:G754)+1)","v":""}]
[null,null,null,null,null,null,{"$f":"IF(H756=\"\",\"\",MAX(G$1:G755)+1)","v":""}]
[null,null,null,null,null,null,{"$f":"IF(H757=\"\",\"\",MAX(G$1:G756)+1)","v":""}]
[null,null,null,null,null,null,{"$f":"IF(H758=\"\",\"\",MAX(G$1:G757)+1)","v":""}]
[null,null,null,null,null,null,{"$f":"IF(H759=\"\",\"\",MAX(G$1:G758)+1)","v":""}]
[null,null,null,null,null,null,{"$f":"IF(H760=\"\",\"\",MAX(G$1:G759)+1)","v":""}]
[null,null,null,null,null,null,{"$f":"IF(H761=\"\",\"\",MAX(G$1:G760)+1)","v":""}]
[null,null,null,null,null,null,{"$f":"IF(H762=\"\",\"\",MAX(G$1:G761)+1)","v":""}]
[null,null,null,null,null,null,{"$f":"IF(H763=\"\",\"\",MAX(G$1:G762)+1)","v":""}]
[null,null,null,null,null,null,{"$f":"IF(H764=\"\",\"\",MAX(G$1:G763)+1)","v":""}]
[null,null,null,null,null,null,{"$f":"IF(H765=\"\",\"\",MAX(G$1:G764)+1)","v":""}]
[null,null,null,null,null,null,{"$f":"IF(H766=\"\",\"\",MAX(G$1:G765)+1)","v":""}]
[null,null,null,null,null,null,{"$f":"IF(H767=\"\",\"\",MAX(G$1:G766)+1)","v":""}]
[null,null,null,null,null,null,{"$f":"IF(H768=\"\",\"\",MAX(G$1:G767)+1)","v":""}]
[null,null,null,null,null,null,{"$f":"IF(H769=\"\",\"\",MAX(G$1:G768)+1)","v":""}]
[null,null,null,null,null,null,{"$f":"IF(H770=\"\",\"\",MAX(G$1:G769)+1)","v":""}]
[null,null,null,null,null,null,{"$f":"IF(H771=\"\",\"\",MAX(G$1:G770)+1)","v":""}]
[null,null,null,null,null,null,{"$f":"IF(H772=\"\",\"\",MAX(G$1:G771)+1)","v":""}]
[null,null,null,null,null,null,{"$f":"IF(H773=\"\",\"\",MAX(G$1:G772)+1)","v":""}]
[null,null,null,null,null,null,{"$f":"IF(H774=\"\",\"\",MAX(G$1:G773)+1)","v":""}]
[null,null,null,null,null,null,{"$f":"IF(H775=\"\",\"\",MAX(G$1:G774)+1)","v":""}]
[null,null,null,null,null,null,{"$f":"IF(H776=\"\",\"\",MAX(G$1:G775)+1)","v":""}]
[null,null,null,null,null,null,{"$f":"IF(H777=\"\",\"\",MAX(G$1:G776)+1)","v":""}]
[null,null,null,null,null,null,{"$f":"IF(H778=\"\",\"\",MAX(G$1:G777)+1)","v":""}]
[null,null,null,null,null,null,{"$f":"IF(H779=\"\",\"\",MAX(G$1:G778)+1)","v":""}]
[null,null,null,null,null,null,{"$f":"IF(H780=\"\",\"\",MAX(G$1:G779)+1)","v":""}]
[null,null,null,null,null,null,{"$f":"IF(H781=\"\",\"\",MAX(G$1:G780)+1)","v":""}]
[null,null,null,null,null,null,{"$f":"IF(H782=\"\",\"\",MAX(G$1:G781)+1)","v":""}]
[null,null,null,null,null,null,{"$f":"IF(H783=\"\",\"\",MAX(G$1:G782)+1)","v":""}]
[null,null,null,null,null,null,{"$f":"IF(H784=\"\",\"\",MAX(G$1:G783)+1)","v":""}]
[null,null,null,null,null,null,{"$f":"IF(H785=\"\",\"\",MAX(G$1:G784)+1)","v":""}]
[null,null,null,null,null,null,{"$f":"IF(H786=\"\",\"\",MAX(G$1:G785)+1)","v":""}]
[null,null,null,null,null,null,{"$f":"IF(H787=\"\",\"\",MAX(G$1:G786)+1)","v":""}]
[null,null,null,null,null,null,{"$f":"IF(H788=\"\",\"\",MAX(G$1:G787)+1)","v":""}]
[null,null,null,null,null,null,{"$f":"IF(H789=\"\",\"\",MAX(G$1:G788)+1)","v":""}]
[null,null,null,null,null,null,{"$f":"IF(H790=\"\",\"\",MAX(G$1:G789)+1)","v":""}]
[null,null,null,null,null,null,{"$f":"IF(H791=\"\",\"\",MAX(G$1:G790)+1)","v":""}]
[null,null,null,null,null,null,{"$f":"IF(H792=\"\",\"\",MAX(G$1:G791)+1)","v":""}]
[null,null,null,null,null,null,{"$f":"IF(H793=\"\",\"\",MAX(G$1:G792)+1)","v":""}]
[null,null,null,null,null,null,{"$f":"IF(H794=\"\",\"\",MAX(G$1:G793)+1)","v":""}]
[null,null,null,null,null,null,{"$f":"IF(H795=\"\",\"\",MAX(G$1:G794)+1)","v":""}]
[null,null,null,null,null,null,{"$f":"IF(H796=\"\",\"\",MAX(G$1:G795)+1)","v":""}]
[null,null,null,null,null,null,{"$f":"IF(H797=\"\",\"\",MAX(G$1:G796)+1)","v":""}]
[null,null,null,null,null,null,{"$f":"IF(H798=\"\",\"\",MAX(G$1:G797)+1)","v":""}]
[null,null,null,null,null,null,{"$f":"IF(H799=\"\",\"\",MAX(G$1:G798)+1)","v":""}]
[null,null,null,null,null,null,{"$f":"IF(H800=\"\",\"\",MAX(G$1:G799)+1)","v":""}]
[null,null,null,null,null,null,{"$f":"IF(H801=\"\",\"\",MAX(G$1:G800)+1)","v":""}]
[null,null,null,null,null,null,{"$f":"IF(H802=\"\",\"\",MAX(G$1:G801)+1)","v":""}]
[null,null,null,null,null,null,{"$f":"IF(H803=\"\",\"\",MAX(G$1:G802)+1)","v":""}]
[null,null,null,null,null,null,{"$f":"IF(H804=\"\",\"\",MAX(G$1:G803)+1)","v":""}]
[null,null,null,null,null,null,{"$f":"IF(H805=\"\",\"\",MAX(G$1:G804)+1)","v":""}]
[null,null,null,null,null,null,{"$f":"IF(H806=\"\",\"\",MAX(G$1:G805)+1)","v":""}]
[null,null,null,null,null,null,{"$f":"IF(H807=\"\",\"\",MAX(G$1:G806)+1)","v":""}]
[null,null,null,null,null,null,{"$f":"IF(H808=\"\",\"\",MAX(G$1:G807)+1)","v":""}]
[null,null,null,null,null,null,{"$f":"IF(H809=\"\",\"\",MAX(G$1:G808)+1)","v":""}]
[null,null,null,null,null,null,{"$f":"IF(H810=\"\",\"\",MAX(G$1:G809)+1)","v":""}]
[null,null,null,null,null,null,{"$f":"IF(H811=\"\",\"\",MAX(G$1:G810)+1)","v":""}]
[null,null,null,null,null,null,{"$f":"IF(H812=\"\",\"\",MAX(G$1:G811)+1)","v":""}]
[null,null,null,null,null,null,{"$f":"IF(H813=\"\",\"\",MAX(G$1:G812)+1)","v":""}]
[null,null,null,null,null,null,{"$f":"IF(H814=\"\",\"\",MAX(G$1:G813)+1)","v":""}]
[null,null,null,null,null,null,{"$f":"IF(H815=\"\",\"\",MAX(G$1:G814)+1)","v":""}]
[null,null,null,null,null,null,{"$f":"IF(H816=\"\",\"\",MAX(G$1:G815)+1)","v":""}]
[null,null,null,null,null,null,{"$f":"IF(H817=\"\",\"\",MAX(G$1:G816)+1)","v":""}]
[null,null,null,null,null,null,{"$f":"IF(H818=\"\",\"\",MAX(G$1:G817)+1)","v":""}]
[null,null,null,null,null,null,{"$f":"IF(H819=\"\",\"\",MAX(G$1:G818)+1)","v":""}]
[null,null,null,null,null,null,{"$f":"IF(H820=\"\",\"\",MAX(G$1:G819)+1)","v":""}]
[null,null,null,null,null,null,{"$f":"IF(H821=\"\",\"\",MAX(G$1:G820)+1)","v":""}]
[null,null,null,null,null,null,{"$f":"IF(H822=\"\",\"\",MAX(G$1:G821)+1)","v":""}]
[null,null,null,null,null,null,{"$f":"IF(H823=\"\",\"\",MAX(G$1:G822)+1)","v":""}]
[null,null,null,null,null,null,{"$f":"IF(H824=\"\",\"\",MAX(G$1:G823)+1)","v":""}]
[null,null,null,null,null,null,{"$f":"IF(H825=\"\",\"\",MAX(G$1:G824)+1)","v":""}]
[null,null,null,null,null,null,{"$f":"IF(H826=\"\",\"\",MAX(G$1:G825)+1)","v":""}]
[null,null,null,null,null,null,{"$f":"IF(H827=\"\",\"\",MAX(G$1:G826)+1)","v":""}]
[null,null,null,null,null,null,{"$f":"IF(H828=\"\",\"\",MAX(G$1:G827)+1)","v":""}]
[null,null,null,null,null,null,{"$f":"IF(H829=\"\",\"\",MAX(G$1:G828)+1)","v":""}]
[null,null,null,null,null,null,{"$f":"IF(H830=\"\",\"\",MAX(G$1:G829)+1)","v":""}]
[null,null,null,null,null,null,{"$f":"IF(H831=\"\",\"\",MAX(G$1:G830)+1)","v":""}]
[null,null,null,null,null,null,{"$f":"IF(H832=\"\",\"\",MAX(G$1:G831)+1)","v":""}]
[null,null,null,null,null,null,{"$f":"IF(H833=\"\",\"\",MAX(G$1:G832)+1)","v":""}]
[null,null,null,null,null,null,{"$f":"IF(H834=\"\",\"\",MAX(G$1:G833)+1)","v":""}]
[null,null,null,null,null,null,{"$f":"IF(H835=\"\",\"\",MAX(G$1:G834)+1)","v":""}]
[null,null,null,null,null,null,{"$f":"IF(H836=\"\",\"\",MAX(G$1:G835)+1)","v":""}]
[null,null,null,null,null,null,{"$f":"IF(H837=\"\",\"\",MAX(G$1:G836)+1)","v":""}]
[null,null,null,null,null,null,{"$f":"IF(H838=\"\",\"\",MAX(G$1:G837)+1)","v":""}]
[null,null,null,null,null,null,{"$f":"IF(H839=\"\",\"\",MAX(G$1:G838)+1)","v":""}]
[null,null,null,null,null,null,{"$f":"IF(H840=\"\",\"\",MAX(G$1:G839)+1)","v":""}]
[null,null,null,null,null,null,{"$f":"IF(H841=\"\",\"\",MAX(G$1:G840)+1)","v":""}]
[null,null,null,null,null,null,{"$f":"IF(H842=\"\",\"\",MAX(G$1:G841)+1)","v":""}]
[null,null,null,null,null,null,{"$f":"IF(H843=\"\",\"\",MAX(G$1:G842)+1)","v":""}]
[null,null,null,null,null,null,{"$f":"IF(H844=\"\",\"\",MAX(G$1:G843)+1)","v":""}]
[null,null,null,null,null,null,{"$f":"IF(H845=\"\",\"\",MAX(G$1:G844)+1)","v":""}]
[null,null,null,null,null,null,{"$f":"IF(H846=\"\",\"\",MAX(G$1:G845)+1)","v":""}]
[null,null,null,null,null,null,{"$f":"IF(H847=\"\",\"\",MAX(G$1:G846)+1)","v":""}]
[null,null,null,null,null,null,{"$f":"IF(H848=\"\",\"\",MAX(G$1:G847)+1)","v":""}]
[null,null,null,null,null,null,{"$f":"IF(H849=\"\",\"\",MAX(G$1:G848)+1)","v":""}]
[null,null,null,null,null,null,{"$f":"IF(H850=\"\",\"\",MAX(G$1:G849)+1)","v":""}]
[null,null,null,null,null,null,{"$f":"IF(H851=\"\",\"\",MAX(G$1:G850)+1)","v":""}]
[null,null,null,null,null,null,{"$f":"IF(H852=\"\",\"\",MAX(G$1:G851)+1)","v":""}]
[null,null,null,null,null,null,{"$f":"IF(H853=\"\",\"\",MAX(G$1:G852)+1)","v":""}]
[null,null,null,null,null,null,{"$f":"IF(H854=\"\",\"\",MAX(G$1:G853)+1)","v":""}]
[null,null,null,null,null,null,{"$f":"IF(H855=\"\",\"\",MAX(G$1:G854)+1)","v":""}]
[null,null,null,null,null,null,{"$f":"IF(H856=\"\",\"\",MAX(G$1:G855)+1)","v":""}]
[null,null,null,null,null,null,{"$f":"IF(H857=\"\",\"\",MAX(G$1:G856)+1)","v":""}]
[null,null,null,null,null,null,{"$f":"IF(H858=\"\",\"\",MAX(G$1:G857)+1)","v":""}]
[null,null,null,null,null,null,{"$f":"IF(H859=\"\",\"\",MAX(G$1:G858)+1)","v":""}]
[null,null,null,null,null,null,{"$f":"IF(H860=\"\",\"\",MAX(G$1:G859)+1)","v":""}]
[null,null,null,null,null,null,{"$f":"IF(H861=\"\",\"\",MAX(G$1:G860)+1)","v":""}]
[null,null,null,null,null,null,{"$f":"IF(H862=\"\",\"\",MAX(G$1:G861)+1)","v":""}]
[null,null,null,null,null,null,{"$f":"IF(H863=\"\",\"\",MAX(G$1:G862)+1)","v":""}]
[null,null,null,null,null,null,{"$f":"IF(H864=\"\",\"\",MAX(G$1:G863)+1)","v":""}]
[null,null,null,null,null,null,{"$f":"IF(H865=\"\",\"\",MAX(G$1:G864)+1)","v":""}]
[null,null,null,null,null,null,{"$f":"IF(H866=\"\",\"\",MAX(G$1:G865)+1)","v":""}]
[null,null,null,null,null,null,{"$f":"IF(H867=\"\",\"\",MAX(G$1:G866)+1)","v":""}]
[null,null,null,null,null,null,{"$f":"IF(H868=\"\",\"\",MAX(G$1:G867)+1)","v":""}]
[null,null,null,null,null,null,{"$f":"IF(H869=\"\",\"\",MAX(G$1:G868)+1)","v":""}]
[null,null,null,null,null,null,{"$f":"IF(H870=\"\",\"\",MAX(G$1:G869)+1)","v":""}]
[null,null,null,null,null,null,{"$f":"IF(H871=\"\",\"\",MAX(G$1:G870)+1)","v":""}]
[null,null,null,null,null,null,{"$f":"IF(H872=\"\",\"\",MAX(G$1:G871)+1)","v":""}]
[null,null,null,null,null,null,{"$f":"IF(H873=\"\",\"\",MAX(G$1:G872)+1)","v":""}]
[null,null,null,null,null,null,{"$f":"IF(H874=\"\",\"\",MAX(G$1:G873)+1)","v":""}]
[null,null,null,null,null,null,{"$f":"IF(H875=\"\",\"\",MAX(G$1:G874)+1)","v":""}]
[null,null,null,null,null,null,{"$f":"IF(H876=\"\",\"\",MAX(G$1:G875)+1)","v":""}]
[null,null,null,null,null,null,{"$f":"IF(H877=\"\",\"\",MAX(G$1:G876)+1)","v":""}]
[null,null,null,null,null,null,{"$f":"IF(H878=\"\",\"\",MAX(G$1:G877)+1)","v":""}]
[null,null,null,null,null,null,{"$f":"IF(H879=\"\",\"\",MAX(G$1:G878)+1)","v":""}]
[null,null,null,null,null,null,{"$f":"IF(H880=\"\",\"\",MAX(G$1:G879)+1)","v":""}]
[null,null,null,null,null,null,{"$f":"IF(H881=\"\",\"\",MAX(G$1:G880)+1)","v":""}]
[null,null,null,null,null,null,{"$f":"IF(H882=\"\",\"\",MAX(G$1:G881)+1)","v":""}]
[null,null,null,null,null,null,{"$f":"IF(H883=\"\",\"\",MAX(G$1:G882)+1)","v":""}]
[null,null,null,null,null,null,{"$f":"IF(H884=\"\",\"\",MAX(G$1:G883)+1)","v":""}]
[null,null,null,null,null,null,{"$f":"IF(H885=\"\",\"\",MAX(G$1:G884)+1)","v":""}]
[null,null,null,null,null,null,{"$f":"IF(H886=\"\",\"\",MAX(G$1:G885)+1)","v":""}]
[null,null,null,null,null,null,{"$f":"IF(H887=\"\",\"\",MAX(G$1:G886)+1)","v":""}]
[null,null,null,null,null,null,{"$f":"IF(H888=\"\",\"\",MAX(G$1:G887)+1)","v":""}]
[null,null,null,null,null,null,{"$f":"IF(H889=\"\",\"\",MAX(G$1:G888)+1)","v":""}]
[null,null,null,null,null,null,{"$f":"IF(H890=\"\",\"\",MAX(G$1:G889)+1)","v":""}]
[null,null,null,null,null,null,{"$f":"IF(H891=\"\",\"\",MAX(G$1:G890)+1)","v":""}]
[null,null,null,null,null,null,{"$f":"IF(H892=\"\",\"\",MAX(G$1:G891)+1)","v":""}]
[null,null,null,null,null,null,{"$f":"IF(H893=\"\",\"\",MAX(G$1:G892)+1)","v":""}]
[null,null,null,null,null,null,{"$f":"IF(H894=\"\",\"\",MAX(G$1:G893)+1)","v":""}]
[null,null,null,null,null,null,{"$f":"IF(H895=\"\",\"\",MAX(G$1:G894)+1)","v":""}]
[null,null,null,null,null,null,{"$f":"IF(H896=\"\",\"\",MAX(G$1:G895)+1)","v":""}]
[null,null,null,null,null,null,{"$f":"IF(H897=\"\",\"\",MAX(G$1:G896)+1)","v":""}]
[null,null,null,null,null,null,{"$f":"IF(H898=\"\",\"\",MAX(G$1:G897)+1)","v":""}]
[null,null,null,null,null,null,{"$f":"IF(H899=\"\",\"\",MAX(G$1:G898)+1)","v":""}]
[null,null,null,null,null,null,{"$f":"IF(H900=\"\",\"\",MAX(G$1:G899)+1)","v":""}]
[null,null,null,null,null,null,{"$f":"IF(H901=\"\",\"\",MAX(G$1:G900)+1)","v":""}]
[null,null,null,null,null,null,{"$f":"IF(H902=\"\",\"\",MAX(G$1:G901)+1)","v":""}]
[null,null,null,null,null,null,{"$f":"IF(H903=\"\",\"\",MAX(G$1:G902)+1)","v":""}]
[null,null,null,null,null,null,{"$f":"IF(H904=\"\",\"\",MAX(G$1:G903)+1)","v":""}]
[null,null,null,null,null,null,{"$f":"IF(H905=\"\",\"\",MAX(G$1:G904)+1)","v":""}]
[null,null,null,null,null,null,{"$f":"IF(H906=\"\",\"\",MAX(G$1:G905)+1)","v":""}]
[null,null,null,null,null,null,{"$f":"IF(H907=\"\",\"\",MAX(G$1:G906)+1)","v":""}]
[null,null,null,null,null,null,{"$f":"IF(H908=\"\",\"\",MAX(G$1:G907)+1)","v":""}]
[null,null,null,null,null,null,{"$f":"IF(H909=\"\",\"\",MAX(G$1:G908)+1)","v":""}]
[null,null,null,null,null,null,{"$f":"IF(H910=\"\",\"\",MAX(G$1:G909)+1)","v":""}]
[null,null,null,null,null,null,{"$f":"IF(H911=\"\",\"\",MAX(G$1:G910)+1)","v":""}]
[null,null,null,null,null,null,{"$f":"IF(H912=\"\",\"\",MAX(G$1:G911)+1)","v":""}]
[null,null,null,null,null,null,{"$f":"IF(H913=\"\",\"\",MAX(G$1:G912)+1)","v":""}]
[null,null,null,null,null,null,{"$f":"IF(H914=\"\",\"\",MAX(G$1:G913)+1)","v":""}]
[null,null,null,null,null,null,{"$f":"IF(H915=\"\",\"\",MAX(G$1:G914)+1)","v":""}]
[null,null,null,null,null,null,{"$f":"IF(H916=\"\",\"\",MAX(G$1:G915)+1)","v":""}]
[null,null,null,null,null,null,{"$f":"IF(H917=\"\",\"\",MAX(G$1:G916)+1)","v":""}]
[null,null,null,null,null,null,{"$f":"IF(H918=\"\",\"\",MAX(G$1:G917)+1)","v":""}]
[null,null,null,null,null,null,{"$f":"IF(H919=\"\",\"\",MAX(G$1:G918)+1)","v":""}]
[null,null,null,null,null,null,{"$f":"IF(H920=\"\",\"\",MAX(G$1:G919)+1)","v":""}]
[null,null,null,null,null,null,{"$f":"IF(H921=\"\",\"\",MAX(G$1:G920)+1)","v":""}]
[null,null,null,null,null,null,{"$f":"IF(H922=\"\",\"\",MAX(G$1:G921)+1)","v":""}]
[null,null,null,null,null,null,{"$f":"IF(H923=\"\",\"\",MAX(G$1:G922)+1)","v":""}]
[null,null,null,null,null,null,{"$f":"IF(H924=\"\",\"\",MAX(G$1:G923)+1)","v":""}]
[null,null,null,null,null,null,{"$f":"IF(H925=\"\",\"\",MAX(G$1:G924)+1)","v":""}]
[null,null,null,null,null,null,{"$f":"IF(H926=\"\",\"\",MAX(G$1:G925)+1)","v":""}]
[null,null,null,null,null,null,{"$f":"IF(H927=\"\",\"\",MAX(G$1:G926)+1)","v":""}]
[null,null,null,null,null,null,{"$f":"IF(H928=\"\",\"\",MAX(G$1:G927)+1)","v":""}]
[null,null,null,null,null,null,{"$f":"IF(H929=\"\",\"\",MAX(G$1:G928)+1)","v":""}]
[null,null,null,null,null,null,{"$f":"IF(H930=\"\",\"\",MAX(G$1:G929)+1)","v":""}]
[null,null,null,null,null,null,{"$f":"IF(H931=\"\",\"\",MAX(G$1:G930)+1)","v":""}]
[null,null,null,null,null,null,{"$f":"IF(H932=\"\",\"\",MAX(G$1:G931)+1)","v":""}]
[null,null,null,null,null,null,{"$f":"IF(H933=\"\",\"\",MAX(G$1:G932)+1)","v":""}]
[null,null,null,null,null,null,{"$f":"IF(H934=\"\",\"\",MAX(G$1:G933)+1)","v":""}]
[null,null,null,null,null,null,{"$f":"IF(H935=\"\",\"\",MAX(G$1:G934)+1)","v":""}]
[null,null,null,null,null,null,{"$f":"IF(H936=\"\",\"\",MAX(G$1:G935)+1)","v":""}]
[null,null,null,null,null,null,{"$f":"IF(H937=\"\",\"\",MAX(G$1:G936)+1)","v":""}]
[null,null,null,null,null,null,{"$f":"IF(H938=\"\",\"\",MAX(G$1:G937)+1)","v":""}]
[null,null,null,null,null,null,{"$f":"IF(H939=\"\",\"\",MAX(G$1:G938)+1)","v":""}]
[null,null,null,null,null,null,{"$f":"IF(H940=\"\",\"\",MAX(G$1:G939)+1)","v":""}]
[null,null,null,null,null,null,{"$f":"IF(H941=\"\",\"\",MAX(G$1:G940)+1)","v":""}]
[null,null,null,null,null,null,{"$f":"IF(H942=\"\",\"\",MAX(G$1:G941)+1)","v":""}]
[null,null,null,null,null,null,{"$f":"IF(H943=\"\",\"\",MAX(G$1:G942)+1)","v":""}]
[null,null,null,null,null,null,{"$f":"IF(H944=\"\",\"\",MAX(G$1:G943)+1)","v":""}]
[null,null,null,null,null,null,{"$f":"IF(H945=\"\",\"\",MAX(G$1:G944)+1)","v":""}]
[null,null,null,null,null,null,{"$f":"IF(H946=\"\",\"\",MAX(G$1:G945)+1)","v":""}]
[null,null,null,null,null,null,{"$f":"IF(H947=\"\",\"\",MAX(G$1:G946)+1)","v":""}]
[null,null,null,null,null,null,{"$f":"IF(H948=\"\",\"\",MAX(G$1:G947)+1)","v":""}]
[null,null,null,null,null,null,{"$f":"IF(H949=\"\",\"\",MAX(G$1:G948)+1)","v":""}]
[null,null,null,null,null,null,{"$f":"IF(H950=\"\",\"\",MAX(G$1:G949)+1)","v":""}]
[null,null,null,null,null,null,{"$f":"IF(H951=\"\",\"\",MAX(G$1:G950)+1)","v":""}]
[null,null,null,null,null,null,{"$f":"IF(H952=\"\",\"\",MAX(G$1:G951)+1)","v":""}]
[null,null,null,null,null,null,{"$f":"IF(H953=\"\",\"\",MAX(G$1:G952)+1)","v":""}]
[null,null,null,null,null,null,{"$f":"IF(H954=\"\",\"\",MAX(G$1:G953)+1)","v":""}]
[null,null,null,null,null,null,{"$f":"IF(H955=\"\",\"\",MAX(G$1:G954)+1)","v":""}]
[null,null,null,null,null,null,{"$f":"IF(H956=\"\",\"\",MAX(G$1:G955)+1)","v":""}]
[null,null,null,null,null,null,{"$f":"IF(H957=\"\",\"\",MAX(G$1:G956)+1)","v":""}]
[null,null,null,null,null,null,{"$f":"IF(H958=\"\",\"\",MAX(G$1:G957)+1)","v":""}]
[null,null,null,null,null,null,{"$f":"IF(H959=\"\",\"\",MAX(G$1:G958)+1)","v":""}]
[null,null,null,null,null,null,{"$f":"IF(H960=\"\",\"\",MAX(G$1:G959)+1)","v":""}]
[null,null,null,null,null,null,{"$f":"IF(H961=\"\",\"\",MAX(G$1:G960)+1)","v":""}]
[null,null,null,null,null,null,{"$f":"IF(H962=\"\",\"\",MAX(G$1:G961)+1)","v":""}]
[null,null,null,null,null,null,{"$f":"IF(H963=\"\",\"\",MAX(G$1:G962)+1)","v":""}]
[null,null,null,null,null,null,{"$f":"IF(H964=\"\",\"\",MAX(G$1:G963)+1)","v":""}]
[null,null,null,null,null,null,{"$f":"IF(H965=\"\",\"\",MAX(G$1:G964)+1)","v":""}]
[null,null,null,null,null,null,{"$f":"IF(H966=\"\",\"\",MAX(G$1:G965)+1)","v":""}]
[null,null,null,null,null,null,{"$f":"IF(H967=\"\",\"\",MAX(G$1:G966)+1)","v":""}]
[null,null,null,null,null,null,{"$f":"IF(H968=\"\",\"\",MAX(G$1:G967)+1)","v":""}]
[null,null,null,null,null,null,{"$f":"IF(H969=\"\",\"\",MAX(G$1:G968)+1)","v":""}]
[null,null,null,null,null,null,{"$f":"IF(H970=\"\",\"\",MAX(G$1:G969)+1)","v":""}]
[null,null,null,null,null,null,{"$f":"IF(H971=\"\",\"\",MAX(G$1:G970)+1)","v":""}]
[null,null,null,null,null,null,{"$f":"IF(H972=\"\",\"\",MAX(G$1:G971)+1)","v":""}]
[null,null,null,null,null,null,{"$f":"IF(H973=\"\",\"\",MAX(G$1:G972)+1)","v":""}]
[null,null,null,null,null,null,{"$f":"IF(H974=\"\",\"\",MAX(G$1:G973)+1)","v":""}]
[null,null,null,null,null,null,{"$f":"IF(H975=\"\",\"\",MAX(G$1:G974)+1)","v":""}]
[null,null,null,null,null,null,{"$f":"IF(H976=\"\",\"\",MAX(G$1:G975)+1)","v":""}]
[null,null,null,null,null,null,{"$f":"IF(H977=\"\",\"\",MAX(G$1:G976)+1)","v":""}]
[null,null,null,null,null,null,{"$f":"IF(H978=\"\",\"\",MAX(G$1:G977)+1)","v":""}]
[null,null,null,null,null,null,{"$f":"IF(H979=\"\",\"\",MAX(G$1:G978)+1)","v":""}]
[null,null,null,null,null,null,{"$f":"IF(H980=\"\",\"\",MAX(G$1:G979)+1)","v":""}]
[null,null,null,null,null,null,{"$f":"IF(H981=\"\",\"\",MAX(G$1:G980)+1)","v":""}]
[null,null,null,null,null,null,{"$f":"IF(H982=\"\",\"\",MAX(G$1:G981)+1)","v":""}]
[null,null,null,null,null,null,{"$f":"IF(H983=\"\",\"\",MAX(G$1:G982)+1)","v":""}]
[null,null,null,null,null,null,{"$f":"IF(H984=\"\",\"\",MAX(G$1:G983)+1)","v":""}]
[null,null,null,null,null,null,{"$f":"IF(H985=\"\",\"\",MAX(G$1:G984)+1)","v":""}]
[null,null,null,null,null,null,{"$f":"IF(H986=\"\",\"\",MAX(G$1:G985)+1)","v":""}]
[null,null,null,null,null,null,{"$f":"IF(H987=\"\",\"\",MAX(G$1:G986)+1)","v":""}]
[null,null,null,null,null,null,{"$f":"IF(H988=\"\",\"\",MAX(G$1:G987)+1)","v":""}]
[null,null,null,null,null,null,{"$f":"IF(H989=\"\",\"\",MAX(G$1:G988)+1)","v":""}]
[null,null,null,null,null,null,{"$f":"IF(H990=\"\",\"\",MAX(G$1:G989)+1)","v":""}]
[null,null,null,null,null,null,{"$f":"IF(H991=\"\",\"\",MAX(G$1:G990)+1)","v":""}]
[null,null,null,null,null,null,{"$f":"IF(H992=\"\",\"\",MAX(G$1:G991)+1)","v":""}]
[null,null,null,null,null,null,{"$f":"IF(H993=\"\",\"\",MAX(G$1:G992)+1)","v":""}]
[null,null,null,null,null,null,{"$f":"IF(H994=\"\",\"\",MAX(G$1:G993)+1)","v":""}]
[null,null,null,null,null,null,{"$f":"IF(H995=\"\",\"\",MAX(G$1:G994)+1)","v":""}]
[null,null,null,null,null,null,{"$f":"IF(H996=\"\",\"\",MAX(G$1:G995)+1)","v":""}]
[null,null,null,null,null,null,{"$f":"IF(H997=\"\",\"\",MAX(G$1:G996)+1)","v":""}]
[null,null,null,null,null,null,{"$f":"IF(H998=\"\",\"\",MAX(G$1:G997)+1)","v":""}]
[null,null,null,null,null,null,{"$f":"IF(H999=\"\",\"\",MAX(G$1:G998)+1)","v":""}]
[null,null,null,null,null,null,{"$f":"IF(H1000=\"\",\"\",MAX(G$1:G999)+1)","v":""}]
[null,null,null,null,null,null,{"$f":"IF(H1001=\"\",\"\",MAX(G$1:G1000)+1)","v":""}]
[null,null,null,null,null,null,{"$f":"IF(H1002=\"\",\"\",MAX(G$1:G1001)+1)","v":""}]
[null,null,null,null,null,null,{"$f":"IF(H1003=\"\",\"\",MAX(G$1:G1002)+1)","v":""}]

{"sheet":"DATOS P","index":7,"n_rows":559,"n_cols":5,"rows_kept":559,"cut":false,"hidden":true,"merged":[]}
["ID_AGENTE","RESPONSABLE","NOMBRE_AGENTE","CONSECION","CODIGO"]
["AG771","ACTIVO","Five Star Management, S. A.","EDEMET","FIVESTAR"]
["AG256","GRAN CLIENTE ACTIVO","Arce Avícola, S.A. (OLD)","ENSA","ARCEAV"]
["AG183","GRAN CLIENTE ACTIVO","Empaques de Colón, S.A.","ENSA","ECSA"]
["AG887","GRAN CLIENTE ACTIVO","Minera Panamá, S. A. (Gran Cliente)",null,"MINPMAGCA"]
["AG287","GRAN CLIENTE ACTIVO","Autoridad del Canal de Panamá - Planta Potabilizadora Mendoza - Activo","EDEMET","POTMEN"]
["AG423","GRAN CLIENTE ACTIVO","Panadería Santa Librada – ACTIVO","EDEMET","P_SLIBRADA"]
["AG705","GRAN CLIENTE ACTIVO","Súper Carnes Aguadulce - Importadora Virzi, S.A. (Old)","EDEMET","SCARAG_ACTIVO"]
["AG706","GRAN CLIENTE ACTIVO","Súper Carnes Palermo - Importadora Virzi, S.A. (Old)","EDEMET","SCARPALE_ACTIVO"]
["AG225","GRAN CLIENTE ACTIVO","Servicios de Carnes, S.A.","EDEMET","SERVICAR"]
["AG111","DISTRIBUIDORES Y AUTOGENERADORES","Azucarera Nacional, S. A.",null,"ANSA"]
["AG002","DISTRIBUIDORES Y AUTOGENERADORES","Autoridad del Canal de Panamá",null,"ACP"]
["AG640","DISTRIBUIDORES Y AUTOGENERADORES","Central Azucarero de Alanje, S. A.",null,"CADASA"]
["AG015","DISTRIBUIDORES Y AUTOGENERADORES","Empresa de Distribución Eléctrica Chiriquí, S. A.",null,"EDECHI"]
["AG014","DISTRIBUIDORES Y AUTOGENERADORES","Empresa de Distribución Eléctrica Metro Oeste, S. A.",null,"EDEMET"]
["AG013","DISTRIBUIDORES Y AUTOGENERADORES","Empresa de Distribución Eléctrica Elektra Noreste, S. A.",null,"ENSA"]
["AG164","DISTRIBUIDORES Y AUTOGENERADORES","Minera Panamá, S.A.",null,"MINERAPMA"]
["AG155","AES Panamá, S.R.L.","Aceti-Oxígeno, S.A.","EDEMET","ACETIOX"]
["AG513","AES Panamá, S.R.L.","Agroindustrial CEDI y Carnes (Curundú)","EDEMET","AGCEDICAR"]
["AG585","AES Panamá, S.R.L.","Assa Calle 50","EDEMET","ASSAC50"]
["AG458","AES Panamá, S.R.L.","Banco General Centro Operativo","ENSA","BGRALCO64"]
["AG537","AES Panamá, S.R.L.","Banistmo Plaza Edison","EDEMET","BIPEDISON"]
["AG767","AES Panamá, S.R.L.","Bimbo de Panamá, S.A.","EDEMET","BIMBO"]
["AG855","AES Panamá, S.R.L.","Biomuseo","EDEMET","GCP0628"]
["AG042","AES Panamá, S.R.L.","Cemento Bayano","ENSA","CEMEX"]
["AG507","AES Panamá, S.R.L.","Cemento Bayano Juan Díaz","ENSA","CEMEXJDIAZ"]
["AG095","AES Panamá, S.R.L.","Cemento Interoceánico (Industrias Básicas, S. A.)","EDEMET","CEMINTER"]
["AG827","AES Panamá, S.R.L.","Cervecería Barú","ENSA","GCP0606"]
["AG138","AES Panamá, S.R.L.","Cervecería Nacional","EDEMET","CNAL"]
["AG088","AES Panamá, S.R.L.","Contraloría General","EDEMET","CONTRAL"]
["AG676","AES Panamá, S.R.L.","Copama Villa Lucre","ENSA","COPAVILU"]
["AG684","AES Panamá, S.R.L.","Corporación Pio Pio  Oficina Llano Bonito","ENSA","MELOOFLBON"]
["AG435","AES Panamá, S.R.L.","Costa del Este Town Center","ENSA","TOWNCENTER"]
["AG173","AES Panamá, S.R.L.","Destilería San Isidro","EDEMET","VH_DES"]
["AG252","AES Panamá, S.R.L.","Edificio Business Park","ENSA","BPARK"]
["AG098","AES Panamá, S.R.L.","Embajada de los Estados Unidos de América","EDEMET","EEUA"]
["AG567","AES Panamá, S.R.L.","Envases Universales Ball de Panamá, S.A.","ENSA","EUBP"]
["AG631","AES Panamá, S.R.L.","Finca de Carriazo","ENSA","FCARRIAZO"]
["AG485","AES Panamá, S.R.L.","Fundación para la Educación en la Televisión, S.A.","ENSA","FETV"]
["AG713","AES Panamá, S.R.L.","Galores Refrigerados, S. A.","ENSA","GALORES"]
["AG913","AES Panamá, S.R.L.","Green Tower Properties, Inc","ENSA","GCP0667"]
["AG496","AES Panamá, S.R.L.","Harina del Istmo, S.A.","ENSA","HARISTMO"]
["AG809","AES Panamá, S.R.L.","Hospital Pacífica Salud Costa del Este","ENSA","HPPCDE"]
["AG792","AES Panamá, S.R.L.","Hospital Punta Pacífica","EDEMET","HPPACIFICA"]
["AG825","AES Panamá, S.R.L.","Hospital Punta Pacífica 3 - Consultorios","EDEMET","GCP0604"]
["AG659","AES Panamá, S.R.L.","Hospital Punta Pacifica 4 - Torres de Enfriamiento","EDEMET","HPUNPAC2"]
["AG499","AES Panamá, S.R.L.","I Storage Inc.","ENSA","ISTORAGE"]
["AG023","AES Panamá, S.R.L.","Mega Depot","EDEMET","MEGAD"]
["AG160","AES Panamá, S.R.L.","Melo EASA Juan Diaz","ENSA","MELOEA"]
["AG683","AES Panamá, S.R.L.","Melo Planta de Cocina Central","ENSA","MELOCOCEN"]
["AG161","AES Panamá, S.R.L.","Melo Planta Manuel Melo","ENSA","MELOMM"]
["AG162","AES Panamá, S.R.L.","Melo Planta Sarasqueta","ENSA","MELOSC"]
["AG163","AES Panamá, S.R.L.","Melo Río Abajo","ENSA","MELORA"]
["AG552","AES Panamá, S.R.L.","Metro de Panamá Estación Los Andes","ENSA","METROAND"]
["AG553","AES Panamá, S.R.L.","Metro de Panamá Estación Plaza 5 de Mayo","EDEMET","METRO5MAY"]
["AG870","AES Panamá, S.R.L.","Mr. Precio (Chitré)","EDEMET","GCP0639"]
["AG527","AES Panamá, S.R.L.","Panafoto Calle 50","EDEMET","PFOTOC50"]
["AG528","AES Panamá, S.R.L.","Panafoto Centenial","ENSA","PFOTOCEN"]
["AG529","AES Panamá, S.R.L.","Panafoto Metromall","ENSA","PFOTOMMALL"]
["AG530","AES Panamá, S.R.L.","Panafoto Zona Libre 1","ENSA","PFOTOZLIB1"]
["AG724","AES Panamá, S.R.L.","Panama Ports Company - Balboa","EDEMET","PPCBALBOA"]
["AG725","AES Panamá, S.R.L.","Panama Ports Company - Cristobal","ENSA","PPCCRIST"]
["AG914","AES Panamá, S.R.L.","PH Empire Residences","ENSA","GCP0666"]
["AG403","AES Panamá, S.R.L.","PH Ocean Two","ENSA","OCEANTWO"]
["AG418","AES Panamá, S.R.L.","PH Ten Tower","ENSA","TENTOWER"]
["AG383","AES Panamá, S.R.L.","PH Vitri Tower","ENSA","PHVITRI85"]
["AG583","AES Panamá, S.R.L.","Producción Panameña de Hielo, S.A.","ENSA","PRODHIELO"]
["AG712","AES Panamá, S.R.L.","PSA Panama International Terminal","EDEMET","PSAINTTERM"]
["AG890","AES Panamá, S.R.L.","RB Cold Chain, Inc","EDEMET","GCP0653"]
["AG506","AES Panamá, S.R.L.","Recuperación de Proteínas, S.A.","ENSA","REDEPROSA"]
["AG826","AES Panamá, S.R.L.","Rey Bella Vista","EDEMET","GCP0605"]
["AG430","AES Panamá, S.R.L.","Rey Brisas Del Golf","ENSA","REYBGOLF"]
["AG708","AES Panamá, S.R.L.","Rey Brisas Norte","ENSA","REYBRINOR"]
["AG540","AES Panamá, S.R.L.","Rey Calle 13","ENSA","REYCALLE13"]
["AG523","AES Panamá, S.R.L.","Rey Calle 50","EDEMET","REYCALLE50"]
["AG451","AES Panamá, S.R.L.","Rey Calle 7","ENSA","REYCALLE7"]
["AG526","AES Panamá, S.R.L.","Rey CEDI Frío","EDEMET","CEDIFRIO"]
["AG431","AES Panamá, S.R.L.","Rey Centennial","ENSA","REYCENTEN"]
["AG428","AES Panamá, S.R.L.","Rey Chanis","ENSA","REYCHANIS"]
["AG520","AES Panamá, S.R.L.","Rey Chorrera","EDEMET","REYCHORRE"]
["AG432","AES Panamá, S.R.L.","Rey Costa Del Este","ENSA","REYCESTE"]
["AG490","AES Panamá, S.R.L.","Rey Costa Verde","EDEMET","REYCVERDE"]
["AG452","AES Panamá, S.R.L.","Rey Cuatro Altos","ENSA","REY4ALTOS"]
["AG427","AES Panamá, S.R.L.","Rey Dorado","ENSA","REYDORADO"]
["AG426","AES Panamá, S.R.L.","Rey Milla 8","ENSA","REYMILLA8"]
["AG434","AES Panamá, S.R.L.","Rey Mrp La Cabima","ENSA","REYMPCAB"]
["AG469","AES Panamá, S.R.L.","Rey Parque Lefevre","ENSA","REYLEFEVRE"]
["AG525","AES Panamá, S.R.L.","Rey Paseo Albrook","EDEMET","REYPASEOAB"]
["AG491","AES Panamá, S.R.L.","Rey Paseo Arraiján","EDEMET","REYPARRAIJ"]
["AG489","AES Panamá, S.R.L.","Rey Paseo del Valle","EDEMET","REYPVALLE"]
["AG538","AES Panamá, S.R.L.","Rey Penonome","EDEMET","REYPME"]
["AG453","AES Panamá, S.R.L.","Rey Sabanitas","ENSA","REYSABANI"]
["AG470","AES Panamá, S.R.L.","Rey Santa María","ENSA","REYSMARIA"]
["AG524","AES Panamá, S.R.L.","Rey Santiago","EDEMET","REYSTGO"]
["AG454","AES Panamá, S.R.L.","Rey Versalles","ENSA","REYVERSAL"]
["AG522","AES Panamá, S.R.L.","Rey Vía España","EDEMET","REYVESPANA"]
["AG429","AES Panamá, S.R.L.","Rey Villa Lucre ","ENSA","REYVLUCRE"]
["AG521","AES Panamá, S.R.L.","Rey Vista Alegre","EDEMET","REYVALEGRE"]
["AG450","AES Panamá, S.R.L.","Rey 12 de octubre","ENSA","REY12OCT"]
["AG433","AES Panamá, S.R.L.","Rey 24 de diciembre","ENSA","REY24DIC"]
["AG024","AES Panamá, S.R.L.","Ricamar (Irisa)","ENSA","S99_RMAR"]
["AG661","AES Panamá, S.R.L.","ScotiaBank El Dorado","ENSA","SCBANK"]
["AG884","AES Panamá, S.R.L.","Super Xtra Chanis","ENSA","GCP0648"]
["AG818","AES Panamá, S.R.L.","Super 99 Aguadulce","EDEMET","GCP0597"]
["AG056","AES Panamá, S.R.L.","Super 99 Albrook","EDEMET","S99_ALBRO"]
["AG080","AES Panamá, S.R.L.","Super 99 Arraijan Valle Hermoso","EDEMET","S99_ARRAJ"]
["AG822","AES Panamá, S.R.L.","Super 99 Balboa","ENSA","GCP0601"]
["AG820","AES Panamá, S.R.L.","Super 99 Bethania","ENSA","GCP0599"]
["AG049","AES Panamá, S.R.L.","Super 99 Brisas del Golf","ENSA","S99_BGOLF"]
["AG142","AES Panamá, S.R.L.","Super 99 Brisas del Golf Arraijan","EDEMET","S99_BGOLFA"]
["AG821","AES Panamá, S.R.L.","Super 99 Chanis","ENSA","GCP0600"]
["AG058","AES Panamá, S.R.L.","Super 99 Chitré","EDEMET","S99_CHITRE"]
["AG067","AES Panamá, S.R.L.","Super 99 Colmar","ENSA","S99_COLMAR"]
["AG069","AES Panamá, S.R.L.","Super 99 Colón 2000","ENSA","S99_COL2K"]
["AG062","AES Panamá, S.R.L.","Super 99 Condado del Rey","ENSA","S99_CONDA"]
["AG055","AES Panamá, S.R.L.","Super 99 Coronado","EDEMET","S99_CORON"]
["AG048","AES Panamá, S.R.L.","Super 99 Costa del Este","ENSA","S99_COSTAE"]
["AG143","AES Panamá, S.R.L.","Super 99 El Coco","EDEMET","S99_COCO"]
["AG039","AES Panamá, S.R.L.","Super 99 El Dorado","ENSA","S99_DORADO"]
["AG047","AES Panamá, S.R.L.","Super 99 El Faro","ENSA","S99_FARO"]
["AG040","AES Panamá, S.R.L.","Super 99 La Cabima","ENSA","S99_CABIMA"]
["AG159","AES Panamá, S.R.L.","Super 99 La Chorrera Plaza OnDgo","EDEMET","S99_ODGCHO"]
["AG070","AES Panamá, S.R.L.","Super 99 La Doña","ENSA","S99_DONA"]
["AG038","AES Panamá, S.R.L.","Super 99 Los Andes","ENSA","S99_ANDES"]
["AG152","AES Panamá, S.R.L.","Super 99 Los Andes Mall 2","ENSA","S99_ANDESM"]
["AG036","AES Panamá, S.R.L.","Super 99 Los Pueblos","ENSA","S99_PUEBLO"]
["AG140","AES Panamá, S.R.L.","Super 99 Mañanitas","ENSA","S99_MANAN"]
["AG054","AES Panamá, S.R.L.","Super 99 Matadero de Soná","EDEMET","S99_MSONA"]
["AG823","AES Panamá, S.R.L.","Super 99 Megamall","ENSA","GCP0602"]
["AG824","AES Panamá, S.R.L.","Super 99 Pedregal","ENSA","GCP0603"]
["AG060","AES Panamá, S.R.L.","Super 99 Penonome","EDEMET","S99_PENON"]
["AG071","AES Panamá, S.R.L.","Super 99 Plaza Carolina","ENSA","S99_PZACAR"]
["AG061","AES Panamá, S.R.L.","Super 99 Plaza Italia","EDEMET","S99_PZAIT"]
["AG050","AES Panamá, S.R.L.","Super 99 Plaza Tocumen","ENSA","S99_PZATOC"]
["AG072","AES Panamá, S.R.L.","Super 99 Portobelo","ENSA","S99_PORTO"]
["AG037","AES Panamá, S.R.L.","Super 99 Puerto Escondido","ENSA","S99_PTOESC"]
["AG046","AES Panamá, S.R.L.","Super 99 Punta Pacífica","EDEMET","S99_PTAPAC"]
["AG130","AES Panamá, S.R.L.","Super 99 Rio Hato","EDEMET","S99_RHATO"]
["AG153","AES Panamá, S.R.L.","Super 99 Sabanitas","ENSA","S99_SABANI"]
["AG057","AES Panamá, S.R.L.","Super 99 San Francisco","EDEMET","S99_SANFCO"]
["AG059","AES Panamá, S.R.L.","Super 99 Santiago","EDEMET","S99_SANTI"]
["AG819","AES Panamá, S.R.L.","Super 99 Town Center Arraijan","EDEMET","GCP0598"]
["AG073","AES Panamá, S.R.L.","Super 99 Tumba Muerto","EDEMET","S99_TMUER"]
["AG083","AES Panamá, S.R.L.","Super 99 Vacamonte","EDEMET","S99_VACAM"]
["AG051","AES Panamá, S.R.L.","Super 99 Vía Porras","EDEMET","S99_VPORR"]
["AG151","AES Panamá, S.R.L.","Super 99 Villa Lucre","ENSA","S99_VLUCRE"]
["AG141","AES Panamá, S.R.L.","Super 99 Villa Zaita","ENSA","S99_VZAITA"]
["AG053","AES Panamá, S.R.L.","Super 99 Vista Hermosa","EDEMET","S99_VHERM"]
["AG645","AES Panamá, S.R.L.","Tikal Intercontinental, S.A.","EDEMET","TIKAL"]
["AG185","AES Panamá, S.R.L.","Toledano Planta de Proceso","ENSA","TDNO_PMA"]
["AG184","AES Panamá, S.R.L.","Toledano Planta Incubadora ","EDEMET","TDNO_CHO"]
["AG191","AES Panamá, S.R.L.","Toledano Procesadora de Aves","ENSA","TDNO_PAV"]
["AG845","AES Panamá, S.R.L.","Universidad Latina Panamá (Ciencias Salud)","EDEMET","GCP0619"]
["AG844","AES Panamá, S.R.L.","Universidad Latina Panamá (Edif. Derecho)","ENSA","GCP0618"]
["AG843","AES Panamá, S.R.L.","Universidad Latina Panamá (Sede Central)","ENSA","GCP0617"]
["AG769","AES Panamá, S.R.L.","Xtra Aguadulce","EDEMET","XADULCE"]
["AG267","AES Panamá, S.R.L.","Xtra Albrook","EDEMET","XALBROOK"]
["AG192","AES Panamá, S.R.L.","Xtra Anclas Mall","EDEMET","XANCLAS"]
["AG233","AES Panamá, S.R.L.","Xtra Arraiján","EDEMET","XARRAIJ"]
["AG424","AES Panamá, S.R.L.","Xtra Cativá","ENSA","XCATIVA"]
["AG750","AES Panamá, S.R.L.","Xtra Chepo","ENSA","XCHEPO"]
["AG193","AES Panamá, S.R.L.","Xtra Chitre","EDEMET","XCHITRE"]
["AG415","AES Panamá, S.R.L.","Xtra Chorrillo","EDEMET","XCHORRILLO"]
["AG196","AES Panamá, S.R.L.","Xtra Condado del Rey","ENSA","XCREY"]
["AG247","AES Panamá, S.R.L.","Xtra El Coco de la Chorrera","EDEMET","XELCOCO"]
["AG197","AES Panamá, S.R.L.","Xtra El Lago","ENSA","XLAGO"]
["AG817","AES Panamá, S.R.L.","Xtra La Siesta","ENSA","GCP0596"]
["AG198","AES Panamá, S.R.L.","Xtra Las Acacias","ENSA","XACACIA"]
["AG623","AES Panamá, S.R.L.","Xtra Las Tablas","EDEMET","XLASTABLAS"]
["AG199","AES Panamá, S.R.L.","Xtra Los Pueblos","ENSA","XPUEBLO"]
["AG885","AES Panamá, S.R.L.","Xtra MF Gran Estación","ENSA","GCP0649"]
["AG200","AES Panamá, S.R.L.","Xtra Monterrico","ENSA","XMRICO"]
["AG201","AES Panamá, S.R.L.","Xtra Oficinas Centrales","ENSA","XOFICENT"]
["AG202","AES Panamá, S.R.L.","Xtra Ojo de Agua","ENSA","XOAGUA"]
["AG203","AES Panamá, S.R.L.","Xtra Pacora","ENSA","XPACORA"]
["AG789","AES Panamá, S.R.L.","Xtra Parque Sur","ENSA","XPSUR"]
["AG297","AES Panamá, S.R.L.","Xtra Penonomé","EDEMET","XPNOME"]
["AG894","AES Panamá, S.R.L.","Xtra Pueblo I","EDEMET","GCP0657"]
["AG895","AES Panamá, S.R.L.","Xtra Pueblo II","EDEMET","GCP0658"]
["AG206","AES Panamá, S.R.L.","Xtra Sabanitas","ENSA","XSBANITA"]
["AG883","AES Panamá, S.R.L.","Xtra San Isidro","ENSA","GCP0647"]
["AG204","AES Panamá, S.R.L.","Xtra San Miguelito","ENSA","XSMGTO"]
["AG194","AES Panamá, S.R.L.","Xtra Santiago","EDEMET","XSTGO"]
["AG709","AES Panamá, S.R.L.","Xtra Terminal Santiago","EDEMET","XTSANTGO"]
["AG416","AES Panamá, S.R.L.","Xtra Transísmica","EDEMET","XTRANSIST"]
["AG752","AES Panamá, S.R.L.","Xtra Vía Israel","EDEMET","XVISRAEL"]
["AG770","AES Panamá, S.R.L.","Xtra Vía La Marquesa","EDEMET","XMARQSA"]
["AG205","AES Panamá, S.R.L.","Xtra Villa Lucre","ENSA","XVLUCRE"]
["AG749","AES Panamá, S.R.L.","Xtra Villalobos","ENSA","XVLOBOS"]
["AG232","AES Panamá, S.R.L.","Xtra Vista Alegre","EDEMET","XVALEGRE"]
["AG816","AES Panamá, S.R.L.","Xtra 4 Altos","ENSA","GCP0595"]
["AG569","AES Panamá, S.R.L.","3M Panamá Pacífico, S. de R.L.","EDEMET","EDIF3M"]
["AG352","Alternegy, S.A.","Aerotel, S.A.","ENSA","HCROWNETOC"]
["AG643","Alternegy, S.A.","Alimentos Cárnicos de Panamá PLANTA","ENSA","ALICAPPLAN"]
["AG246","Alternegy, S.A.","Cía. Alimentos de Animales, S.A.","EDEMET","CADASAGC"]
["AG319","Alternegy, S.A.","Energy Bell Development, Inc","ENSA","EBELL"]
["AG301","Alternegy, S.A.","Hotel Crowne Plaza Panamá 5117897","EDEMET","CROWNPMA"]
["AG302","Alternegy, S.A.","Hotel Dreams Delight Playa Bonita 5117792","EDEMET","HPBONITA"]
["AG300","Alternegy, S.A.","Hotel Holiday Inn Panama Canal 6157018","EDEMET","HHINN"]
["AG299","Alternegy, S.A.","Hotel Miramar Intercontinental 5050163","EDEMET","MIRAMAR"]
["AG303","Alternegy, S.A.","Inmobiliaría Meridiano, S.A.","EDEMET","LEMERID"]
["AG258","Alternegy, S.A.","Pet Panamá","ENSA","PETPMA"]
["AG342","Alternegy, S.A.","PH Acqua1","ENSA","PHACQUA1"]
["AG359","Alternegy, S.A.","PH Torre Global","EDEMET","PHGLOB78"]
["AG437","Alternegy, S.A.","Plásticos Generales","ENSA","PGENERALES"]
["AG242","Alternegy, S.A.","Productos Pascual","ENSA","PASCUAL"]
["AG438","Alternegy, S.A.","Purissima, S. A.","ENSA","PURISSIMA"]
["AG343","Alternegy, S.A.","Silverking Investment Corp.","ENSA","HWESTINCE"]
["AG358","Alternegy, S.A.","The Ocean Club","EDEMET","PHTOC71"]
["AG314","Alternegy, S.A.","Tropical Resorts International Inc Pma","EDEMET","GAMBOA"]
["AG455","Argentum Solar, S.A.","Asamblea de Copropietarios del PH Supercentro el Dorado","ENSA","ASAMCPDOR"]
["AG760","Argentum Solar, S.A.","Banco Aliado, S.A.","EDEMET","BANALIADO"]
["AG838","Argentum Solar, S.A.","El Super Ahorro","ENSA","GCP0616"]
["AG911","Argentum Solar, S.A.","Grupo Ocean, Inc","ENSA","GCP0665"]
["AG277","Argentum Solar, S.A.","Harinera Oro del Norte","EDEMET","ORONORTE"]
["AG832","Argentum Solar, S.A.","Hotel Ejecutivo S.A.","EDEMET","GCP0611"]
["AG907","Argentum Solar, S.A.","Induplast, S. A.","ENSA","GCP0661"]
["AG744","Argentum Solar, S.A.","MC Mercacentro S.A.","EDEMET","MERCACEN"]
["AG389","Argentum Solar, S.A.","Plastiglas, S.A.","ENSA","PLASTIG25"]
["AG691","Argentum Solar, S.A.","Plaza La Felicidad, S. A.","ENSA","PLZFEL"]
["AG546","Argentum Solar, S.A.","Prolacsa","EDEMET","PROLACSA"]
["AG351","Argentum Solar, S.A.","Promotora Supercentro El Dorado, S.A.","ENSA","PROMDOR"]
["AG872","Argentum Solar, S.A.","Semilla Plenitud, S. A.","ENSA","GCP0641"]
["AG281","Argentum Solar, S.A.","Súper Carnes Canto del Llano","EDEMET","SCARCLLAN"]
["AG606","Argentum Solar, S.A.","Super Deli-k","EDEMET","SUPERDELIK"]
["AG766","Autoridad del Canal de Panamá Generador","Autoridad del Canal de Panamá - Planta Potabilizadora Mendoza - PASIVO","EDEMET","POTMEN_PS"]
["AG793","Avanzalia Panamá, S.A.","Hotel Aloft","EDEMET","HALOFT"]
["AG798","Capira Solar, S.A.","Agencia Nuevo Hung Sheng, S.A.","ENSA","HUNGSHENG"]
["AG807","Capira Solar, S.A.","Hotel Ramada S.A.","EDEMET","RAMADA"]
["AG804","Capira Solar, S.A.","Productos Lux, S.A.","ENSA","PROLUXSA"]
["AG280","Capira Solar, S.A.","Súper Carnes Penonomé","EDEMET","SCARPME"]
["AG285","Capira Solar, S.A.","Súper Carnes Vista Alegre","EDEMET","SCARVALG"]
["AG399","Celsia Centroamérica, S. A.","Carnes de Coclé, S.A.","EDEMET","CARCOCLE"]
["AG918","Celsia Centroamérica, S. A.","Del Monte de Panamá, S.A.","ENSA","GCP0670"]
["AG091","Celsia Centroamérica, S. A.","Gold Mills de Panamá, S. A.","EDEMET","GMILLS"]
["AG925","Celsia Centroamérica, S. A.","Papelera Istmeña, S. A.","EDEMET","GCP0676"]
["AG269","Celsia Centroamérica, S. A.","PH Metro Mall","ENSA","PHMMALL"]
["AG919","Celsia Centroamérica, S. A.","Sociedad de Alimentos de Primera, S.A. (BONLAC)","ENSA","GCP0671"]
["AG800","Daconan Solar, S.A","Hotel Sand Diamond.","ENSA","HSDIAMOND"]
["AG797","Daconan Solar, S.A","International Corporation Utilities Management, S.A.","EDEMET","HCENTR72"]
["AG667","Daconan Solar, S.A","PH Ocean Business Plaza","EDEMET","PHOCBUPLZ"]
["AG577","Electron Investment, S. A.","Almacenajes, S.A.","ENSA","ALMACENAJE"]
["AG493","Electron Investment, S. A.","Arcata Company, Inc.","ENSA","ARCATA"]
["AG017","Electron Investment, S. A.","Argos Panamá, S. A.",null,"ARGOS"]
["AG610","Electron Investment, S. A.","Brisas de Amador","EDEMET","BRISASDEAM"]
["AG847","Electron Investment, S. A.","Casino Crown Chorrera","EDEMET","GCP0621"]
["AG846","Electron Investment, S. A.","Casino Crown Riande Aeropuerto","ENSA","GCP0620"]
["AG535","Electron Investment, S. A.","Centro Medico Paitilla 1","EDEMET","CMP1"]
["AG536","Electron Investment, S. A.","Centro Medico Paitilla 2","EDEMET","CMP2"]
["AG910","Electron Investment, S. A.","Corporación Medcom Panamá, S.A. - Edificio Medcom","ENSA","GCP0664"]
["AG620","Electron Investment, S. A.","Crown Casino Hotel Radisson","ENSA","CCROWNHRAD"]
["AG186","Electron Investment, S. A.","Crown Continental","EDEMET","C_CONT"]
["AG187","Electron Investment, S. A.","Crown Guayacanes","EDEMET","C_GUAY"]
["AG188","Electron Investment, S. A.","Crown Hotel Panamá","EDEMET","C_HPMA"]
["AG235","Electron Investment, S. A.","Crown Sheraton","EDEMET","C_SHERAT"]
["AG189","Electron Investment, S. A.","Crown Solloy","EDEMET","C_SOLLOY"]
["AG899","Electron Investment, S. A.","Distribuidora Petro Hielo (Las Mañanitas)","ENSA","GCP0660"]
["AG578","Electron Investment, S. A.","Distribuidora Validreed Arraiján Cabecera","EDEMET","MC_ARRCAB"]
["AG860","Electron Investment, S. A.","Do It Center (Albrook Mall)","EDEMET","GCP0632"]
["AG861","Electron Investment, S. A.","Do It Center (Chitré)","EDEMET","GCP0633"]
["AG863","Electron Investment, S. A.","Do It Center (El Dorado)","ENSA","GCP0635"]
["AG891","Electron Investment, S. A.","Do it Center (Río Abajo)","ENSA","GCP0654"]
["AG864","Electron Investment, S. A.","Do It Center (Westland Mall)","EDEMET","GCP0636"]
["AG350","Electron Investment, S. A.","Doit Center Brisas del Golf","ENSA","DOITBGOL"]
["AG345","Electron Investment, S. A.","Doit Center Centenario","ENSA","DOITCENT"]
["AG348","Electron Investment, S. A.","Doit Center La Doña","ENSA","DOITLDON"]
["AG346","Electron Investment, S. A.","Doit Center Los Pueblos","ENSA","DOITLPUE"]
["AG349","Electron Investment, S. A.","Doit Center Tocumen","ENSA","DOITTOC"]
["AG344","Electron Investment, S. A.","Doit Center 12 de octubre","ENSA","DOIT12OC"]
["AG624","Electron Investment, S. A.","Edificio PH Panamar","EDEMET","PHPANAMAR"]
["AG923","Electron Investment, S. A.","Gaming & Services (Fantastic Milla 8)","ENSA","GCP0674"]
["AG922","Electron Investment, S. A.","Gaming & Services (Fantastic Town Center)","EDEMET","GCP0673"]
["AG876","Electron Investment, S. A.","Grupo Finisterre, S. A. (Marriott Executive Apartments)","EDEMET","GCP0643"]
["AG933","Electron Investment, S. A.","Hípica de Panamá (Hipódromo Crown Casino)","ENSA","GCP0680"]
["AG932","Electron Investment, S. A.","Hípica de Panamá (Hipódromo Establos)","ENSA","GCP0679"]
["AG393","Electron Investment, S. A.","Hotel AC Marriot","EDEMET","ACMARRI97"]
["AG924","Electron Investment, S. A.","Inversiones Pañanitas S.A. (Fantastic Mañanitas)","ENSA","GCP0675"]
["AG510","Electron Investment, S. A.","Jumbo Market, S. A. - Nuevo Arraiján","EDEMET","TAJO_ARR"]
["AG508","Electron Investment, S. A.","Jumbo Market, S. A. - Vacamonte","EDEMET","TAJO_VAC"]
["AG908","Electron Investment, S. A.","Jumbo Market, S.A. (Colón)","ENSA","GCP0662"]
["AG878","Electron Investment, S. A.","Jumbo Market, S.A. (Costa Verde)","EDEMET","GCP0644"]
["AG283","Electron Investment, S. A.","Medcom Cerro Bandera","ENSA","MEDCBAN"]
["AG576","Electron Investment, S. A.","Niels Pedersen, S.A.","ENSA","NIELSPED"]
["AG575","Electron Investment, S. A.","Pedersen Fine Foods, S.A.","ENSA","PEDFFOODS"]
["AG504","Electron Investment, S. A.","Pricesmart Brisas del Golf","ENSA","PRICEBGOLF"]
["AG500","Electron Investment, S. A.","Pricesmart Costa Verde","EDEMET","PRICECVERD"]
["AG505","Electron Investment, S. A.","Pricesmart Oficinas Administrativas","ENSA","PRICEOADM"]
["AG574","Electron Investment, S. A.","Pricesmart Panamá","ENSA","PRICEMPARK"]
["AG502","Electron Investment, S. A.","Pricesmart Santiago","EDEMET","PRICESANT"]
["AG501","Electron Investment, S. A.","Pricesmart Vía Brasil","EDEMET","PRICEVIABR"]
["AG503","Electron Investment, S. A.","Pricesmart Villa De Las Fuentes","ENSA","PRICEVILAF"]
["AG603","Electron Investment, S. A.","Shelter Bay Marina, S.A.","ENSA","SHELTER"]
["AG920","Electron Investment, S. A.","Validreef, S.A. – McDonald’s Vista Alegre","EDEMET","GCP0672"]
["AG176","Enel Fortuna","Agro Industrias Alimenticias de Veraguas, S.A","EDEMET","AGROIND"]
["AG711","Enel Fortuna","Alma de Panamá Oeste","EDEMET","ALMPMAOEST"]
["AG737","Enel Fortuna","Ancon Entertainment, Inc _N","EDEMET","F_ALBROOK"]
["AG440","Enel Fortuna","Arce Avícola Ciudad Radial 357643","ENSA","ARCERADIAL"]
["AG460","Enel Fortuna","Arce Avícola Finca Nevadas 726760","ENSA","ARCENEV60"]
["AG461","Enel Fortuna","Arce Avícola Finca Perú 705133","ENSA","ARCEPERU33"]
["AG441","Enel Fortuna","Arce Avícola La Mesa de San Martín 878592","ENSA","ARCELAMESA"]
["AG472","Enel Fortuna","Arce Avícola Planta de Huevos Fértiles 266785","ENSA","AHUEFER85"]
["AG406","Enel Fortuna","Arce Avícola, S.A.","ENSA","ARCEAV_P"]
["AG627","Enel Fortuna","Asamblea de Propietarios PH Yacht Club Tower","EDEMET","PHYCLUB"]
["AG759","Enel Fortuna","Aseguradora Ancón S.A","ENSA","ASEGANCON"]
["AG726","Enel Fortuna","Automotora Autostar, S.A.","EDEMET","AUTOSTAR"]
["AG739","Enel Fortuna","Banistmo, S. A.","EDEMET","TBANISTMO"]
["AG738","Enel Fortuna","Bingo 90 _N","EDEMET","F_BINGO90"]
["AG811","Enel Fortuna","City Mall Paso Canoas","EDECHI","CYMALLPC"]
["AG707","Enel Fortuna","Compañía Invirmar","EDEMET","HGDAVID"]
["AG836","Enel Fortuna","Compañía Panameña de Aviación, S. A.","EDEMET","GCP0615"]
["AG741","Enel Fortuna","Corporación del presidente de la iglesia de Jesucristo de los Santos de los últimos días","EDEMET","CORPCRISTO"]
["AG236","Enel Fortuna","C&W Aguadulce","EDEMET","CWAGUAS"]
["AG243","Enel Fortuna","C&W Colón","ENSA","CWCOLON"]
["AG237","Enel Fortuna","C&W David","EDECHI","CWDAVID"]
["AG241","Enel Fortuna","C&W El Dorado","ENSA","CWDORADO"]
["AG229","Enel Fortuna","C&W IDC Balboa","EDEMET","CWBAL"]
["AG245","Enel Fortuna","C&W IDC Howard PA","EDEMET","CWHOPA"]
["AG230","Enel Fortuna","C&W IDC Howard PB","EDEMET","CWHOPB"]
["AG239","Enel Fortuna","C&W Juan Franco # 1","EDEMET","CWJFRA1"]
["AG231","Enel Fortuna","C&W Juan Franco #2","EDEMET","CWJFRA2"]
["AG238","Enel Fortuna","C&W La Exposición","EDEMET","CWEXP"]
["AG240","Enel Fortuna","C&W Río Abajo","ENSA","CWRABAJO"]
["AG244","Enel Fortuna","C&W San Francisco","EDEMET","CWSANFCO"]
["AG234","Enel Fortuna","C&W Santa Clara","ENSA","CWSCLARA"]
["AG729","Enel Fortuna","Fantastic Caribe _N","EDEMET","F_CARIBEN"]
["AG734","Enel Fortuna","Fantastic Casa Miller _N","EDEMET","F_CMILLER"]
["AG471","Enel Fortuna","Fantastic Casino Aguadulce","EDEMET","FC_AGDCE"]
["AG721","Enel Fortuna","Fantastic Casino Anclas Mall","EDEMET","F_ANCLASM"]
["AG463","Enel Fortuna","Fantastic Casino El Dorado","ENSA","FC_DORADO"]
["AG462","Enel Fortuna","Fantastic Casino Gran Estación","ENSA","FC_GRANEST"]
["AG474","Enel Fortuna","Fantastic Casino Internacional 1","EDEMET","FC_INTERN1"]
["AG534","Enel Fortuna","Fantastic Casino La Bolera","ENSA","FC_BOLERA"]
["AG467","Enel Fortuna","Fantastic Casino La Cabima","ENSA","FC_CABIMA"]
["AG466","Enel Fortuna","Fantastic Casino La Doña","ENSA","FC_LADONA"]
["AG479","Enel Fortuna","Fantastic Casino Los Andes","ENSA","FC_LANDES"]
["AG464","Enel Fortuna","Fantastic Casino Los Pueblos","ENSA","FC_PUEBLO"]
["AG465","Enel Fortuna","Fantastic Casino Plaza Tocumen","ENSA","FC_PZATOC"]
["AG851","Enel Fortuna","Fantastic Casino San Miguelito","ENSA","GCP0624"]
["AG730","Enel Fortuna","Fantastic Chitré _N","EDEMET","F_CHITREN"]
["AG731","Enel Fortuna","Fantastic Chorrera _N","EDEMET","F_CHORRERA"]
["AG678","Enel Fortuna","Fantastic Oficinas Principales","EDEMET","FCOFPRIN"]
["AG732","Enel Fortuna","Fantastic Penonomé _N","EDEMET","F_PENOME"]
["AG733","Enel Fortuna","Fantastic Santiago _N","EDEMET","F_SANTGO"]
["AG735","Enel Fortuna","Fantastic Villa Zaita _N","ENSA","F_VZAITA"]
["AG736","Enel Fortuna","Fantastic Vista Alegre _N","EDEMET","F_VALEGRE"]
["AG828","Enel Fortuna","Farmacia Arrocha S.A Federal Mall","EDECHI","GCP0607"]
["AG370","Enel Fortuna","Farmacias Arrocha Albrook Mall","EDEMET","FAABRM42"]
["AG367","Enel Fortuna","Farmacias Arrocha Brisas del Golf","ENSA","FABGOL74"]
["AG373","Enel Fortuna","Farmacias Arrocha Calle 50","EDEMET","FA50CA21"]
["AG362","Enel Fortuna","Farmacias Arrocha CEDI 1 Las Cumbres","ENSA","FA1CEDI69"]
["AG363","Enel Fortuna","Farmacias Arrocha CEDI 2 Las Cumbres","ENSA","FA2CEDI64"]
["AG364","Enel Fortuna","Farmacias Arrocha CEDI 3 Las Cumbres","ENSA","FA3CEDI70"]
["AG365","Enel Fortuna","Farmacias Arrocha CEDI 4 Las Cumbres","ENSA","FA4CEDI73"]
["AG366","Enel Fortuna","Farmacias Arrocha CEDI 5 Las Cumbres","ENSA","FA5CEDI85"]
["AG360","Enel Fortuna","Farmacias Arrocha Centenial","ENSA","FACENT92"]
["AG378","Enel Fortuna","Farmacias Arrocha Chitré Paseo Central","EDEMET","FACHIPC91"]
["AG377","Enel Fortuna","Farmacias Arrocha Costa Verde","EDEMET","FACVERD57"]
["AG380","Enel Fortuna","Farmacias Arrocha David Plaza Terronal","EDECHI","FADAVPT75"]
["AG251","Enel Fortuna","Farmacias Arrocha Los Andes","ENSA","FALANDE02"]
["AG288","Enel Fortuna","Farmacias Arrocha Los Pueblos","ENSA","FALPUEB94"]
["AG371","Enel Fortuna","Farmacias Arrocha Oficina 1 Los Ángeles","EDEMET","FAOF1LA14"]
["AG392","Enel Fortuna","Farmacias Arrocha Penonomé","EDEMET","FAPME54"]
["AG379","Enel Fortuna","Farmacias Arrocha Santiago Boulevard","EDEMET","FASANTB81"]
["AG274","Enel Fortuna","Farmacias Arrocha Tumba Muerto","ENSA","FATMUER63"]
["AG361","Enel Fortuna","Farmacias Arrocha Villa Lucre","ENSA","FAVLUC26"]
["AG374","Enel Fortuna","Farmacias Arrocha Westland Mall 1","EDEMET","FA1WESM89"]
["AG376","Enel Fortuna","Farmacias Arrocha Westland Mall 2","EDEMET","FA2WESM91"]
["AG369","Enel Fortuna","Farmacias Arrocha 12 de Octubre","EDEMET","FA12OC96"]
["AG679","Enel Fortuna","Fuerte Amador Resort & Marina, S.A. ","EDEMET","FLAMAR1"]
["AG630","Enel Fortuna","Fundación Ciudad del Saber","EDEMET","CDELSABER"]
["AG805","Enel Fortuna","Fundación Mall City","EDECHI","FMCITY"]
["AG548","Enel Fortuna","GPH, El Dorado","ENSA","GPH_SAKSDO"]
["AG481","Enel Fortuna","Grupo Primavera Holding Los Andes","ENSA","GPH_DORLAN"]
["AG480","Enel Fortuna","Grupo Primavera Holding Los Pueblos","ENSA","GPH_SAKSLP"]
["AG482","Enel Fortuna","Grupo Primavera Holding San Miguelito","ENSA","GPH_SAKSSM"]
["AG477","Enel Fortuna","Grupo Primavera Holdings Albrook","EDEMET","GPH_DORABK"]
["AG626","Enel Fortuna","Hotel Double Tree","EDEMET","HDOUBLE"]
["AG790","Enel Fortuna","Hotel Wyndham Albrook","EDEMET","HWYND_ALB"]
["AG776","Enel Fortuna","Hoteles Decamerón, S.A.","EDEMET","DECAMERON"]
["AG852","Enel Fortuna","Importadora Virzi, S. A. (Oficinas Centrales)","EDEMET","GCP0625"]
["AG853","Enel Fortuna","Importadora Virzi, S. A. (Paseo Miramar, La Chorrera)","EDEMET","GCP0626"]
["AG854","Enel Fortuna","Importadora Virzi, S. A. (Super Carnes Santiago Central 2)","EDEMET","GCP0627"]
["AG156","Enel Fortuna","Industria Panameña de Papel, S.A.","ENSA","IPEL"]
["AG384","Enel Fortuna","Inversiones Vilma, S.A.","ENSA","MPFRIGO57"]
["AG571","Enel Fortuna","Jerusalem de Panamá, S.A.","EDECHI","JERUSALEM"]
["AG638","Enel Fortuna","Jumbo Market","ENSA","JUMBO"]
["AG710","Enel Fortuna","Jumbo Market Chanis","ENSA","JUMBOCH"]
["AG616","Enel Fortuna","KFC Centennial","ENSA","KFCCENTEN"]
["AG644","Enel Fortuna","Kio Networks","EDEMET","KNETWORKS"]
["AG456","Enel Fortuna","London & Regional Panama","EDEMET","LONDONREG"]
["AG357","Enel Fortuna","Machetazo Arraiján 6057243","EDEMET","MARRAI43"]
["AG395","Enel Fortuna","Machetazo Brisas del Golf 21161992","ENSA","MBGOLF92"]
["AG398","Enel Fortuna","Machetazo Calidonia","EDEMET","MCALI43"]
["AG356","Enel Fortuna","Machetazo Calidonia 5050142","EDEMET","MCALID42"]
["AG447","Enel Fortuna","Machetazo Calidonia 5055703","EDEMET","MCALI703"]
["AG889","Enel Fortuna","Machetazo Cedi Milla 8","ENSA","GCP0652"]
["AG402","Enel Fortuna","Machetazo Chitré","EDEMET","MCHITRE86"]
["AG401","Enel Fortuna","Machetazo Coronado 6240012","EDEMET","MCORO12"]
["AG421","Enel Fortuna","Machetazo Costa Sur 21038288","ENSA","MCSUR88"]
["AG857","Enel Fortuna","Machetazo El Dorado","ENSA","GCP0630"]
["AG410","Enel Fortuna","Machetazo Metromall 818731","ENSA","MMALL31"]
["AG396","Enel Fortuna","Machetazo Nuevo Tocumen 21167117","ENSA","MNTOC17"]
["AG355","Enel Fortuna","Machetazo Penonomé 6045583","EDEMET","MPME83"]
["AG448","Enel Fortuna","Machetazo San Miguelito","ENSA","MSANM"]
["AG412","Enel Fortuna","Machetazo Santa Ana","EDEMET","MSTANA"]
["AG400","Enel Fortuna","Machetazo Santiago 4008026","EDEMET","MSGO26"]
["AG439","Enel Fortuna","Machetazo Super Pollmart","EDEMET","MSPOLL"]
["AG425","Enel Fortuna","Machetazo Tocumen 505355","ENSA","MTOC55"]
["AG132","Enel Fortuna","Manzanillo International Terminal Panamá, S.A.","ENSA","MANZANILLO"]
["AG680","Enel Fortuna","Matadero Chiriquí, S.A.","EDECHI","MACHIR"]
["AG648","Enel Fortuna","Mays Zona Libre, S.A. - Circuito Eléctrico","ENSA","MAYSCELECT"]
["AG639","Enel Fortuna","Mays Zona Libre, S.A. - Principal","ENSA","MAYSZL1"]
["AG594","Enel Fortuna","Nikos Balboa","EDEMET","NIKOBAL"]
["AG593","Enel Fortuna","Nikos Calle 50","EDEMET","NIKOC50"]
["AG602","Enel Fortuna","Nikos Dorado","ENSA","NIKODORADO"]
["AG601","Enel Fortuna","Nikos Los Pueblos","ENSA","NIKOPBLOS"]
["AG796","Enel Fortuna","Panadería Santa Librada – Zuellen, S.A.","EDEMET","PSLIBRADA"]
["AG833","Enel Fortuna","Patronato del Hospital Santo Tomás","EDEMET","GCP0612"]
["AG148","Enel Fortuna","Petroterminal de Panamá, S.A. Chiriquí Grande Low","EDECHI","PTPCGL"]
["AG149","Enel Fortuna","Petroterminal de Panamá, S.A. Pump Station A","EDECHI","PTPPSA"]
["AG150","Enel Fortuna","Petroterminal de Panamá, S.A. Pump Station B","EDECHI","PTPPSB"]
["AG549","Enel Fortuna","PH Dream Plaza","ENSA","PHDREAM"]
["AG543","Enel Fortuna","PH Grand Tower","EDEMET","GRANDTOWER"]
["AG686","Enel Fortuna","PH Los Andes Mall","ENSA","PHLAMALL"]
["AG791","Enel Fortuna","PH Plaza del Este","ENSA","PHPESTE"]
["AG652","Enel Fortuna","PH Regalia Tower","ENSA","PHREGALIA"]
["AG743","Enel Fortuna","Polyenvases S. A","ENSA","POLYENSA"]
["AG647","Enel Fortuna","Procesadora industrial de Carnes, S.A.","EDEMET","PROCINDCAR"]
["AG276","Enel Fortuna","Procesadora Monte Azul, S.A.","ENSA","MAZUL"]
["AG633","Enel Fortuna","Promarina","EDEMET","PROMARINA"]
["AG597","Enel Fortuna","Saks Santiago","EDEMET","GPH_SAKSGO"]
["AG727","Enel Fortuna","Saks, Vía España","EDEMET","GPH_SAKSVE"]
["AG687","Enel Fortuna","SmartFit El Cangrejo","EDEMET","SFITECAN"]
["AG688","Enel Fortuna","SmartFit El Dorado","ENSA","SFITEDOR"]
["AG090","Enel Fortuna","Sunstar Hotels and Development, S. A.","EDEMET","SUNSTAR"]
["AG802","Enel Fortuna","Súper Carnes Aguadulce - Importadora Virzi, S.A.","EDEMET","SCARAG"]
["AG801","Enel Fortuna","Súper Carnes Palermo - Importadora Virzi, S.A.","EDEMET","SCARPALE"]
["AG617","Enel Fortuna","Taco Bell El Dorado","ENSA","TBELLDOR"]
["AG803","Enel Fortuna","The Bristol Hotel, S.A","EDEMET","BRISTOL"]
["AG795","Enel Fortuna","The Bristol Resort (Buenaventura)","EDEMET","HBUENAV"]
["AG628","Enel Fortuna","The Evolution Hotel Corp.","EDEMET","HOTELW"]
["AG629","Enel Fortuna","The Panamera Hotel Corp.","EDEMET","HWALDORF"]
["AG625","Enel Fortuna","Universidad Interamericana de Panamá, S. R. L.","ENSA","UIP"]
["AG875","Enel Fortuna","Varsovia Trading, Inc.","EDEMET","GCP0642"]
["AG728","Enel Fortuna","Vista Pacífica de Oriente","ENSA","VTA_PACIFI"]
["AG144","Enel Renovable, S.R.L","Nestle Fabrica de Nata","EDEMET","NESTLENATA"]
["AG136","Enel Renovable, S.R.L","Nestle Oficina Central Centroamérica","EDEMET","NESTLELOMA"]
["AG259","Enel Renovable, S.R.L","Nestlé Parque Sur","ENSA","NESPSUR"]
["AG831","Generación Solar, S. A.","Playa Blanca Hotels Inc.","EDEMET","GCP0610"]
["AG778","Generadora del Istmo, S. A.","Agencias Feduro, S.A. Dorado","ENSA","FEDUDOR"]
["AG779","Generadora del Istmo, S. A.","Agencias Feduro, S.A. Milla 8","ENSA","FEDUM8"]
["AG788","Generadora del Istmo, S. A.","Feduro Aguadulce","EDEMET","FEDUAG"]
["AG794","Generadora del Istmo, S. A.","FELIX Multiplaza (Importadora Maduro)","EDEMET","FMPLAZ40"]
["AG291","Generadora del Istmo, S. A.","Hospital Santa Fe, S.A.","EDEMET","HSANFE20"]
["AG784","Generadora del Istmo, S. A.","Hospitales Nacionales, S.A.","EDEMET","HOSPNAC"]
["AG763","Generadora del Istmo, S. A.","Hotel Best Western El Dorado","ENSA","BWESTDO"]
["AG949","Generadora del Istmo, S. A.","Hotel Hyatt","EDEMET","GCP0695"]
["AG764","Generadora del Istmo, S. A.","Hoteles del Caribe, S.A.","EDEMET","HCARIB"]
["AG308","Generadora del Istmo, S. A.","Industrias Lácteas Aguadulce","EDEMET","INDAGUAD"]
["AG309","Generadora del Istmo, S. A.","Industrias Lácteas Alanje","EDECHI","INDALANJ"]
["AG307","Generadora del Istmo, S. A.","Industrias Lácteas El Espino","EDEMET","INDESPIN"]
["AG337","Generadora del Istmo, S. A.","Industrias Lácteas Oficinas Administrativas ","ENSA","INDOFIC"]
["AG310","Generadora del Istmo, S. A.","Industrias Lácteas, S.A","ENSA","INDTOC"]
["AG765","Generadora del Istmo, S. A.","Industrias Panamá Boston, S.A","EDEMET","PABO"]
["AG457","Generadora del Istmo, S. A.","MMDHotel, S.A. - Best Western Hotel","EDEMET","MMDHOTEL"]
["AG781","Generadora del Istmo, S. A.","Moldeados Panameños, S.A.","ENSA","MOLPASA"]
["AG326","Generadora del Istmo, S. A.","Petite Bottling Company, Inc.","ENSA","PETITEPMA"]
["AG557","Generadora del Istmo, S. A.","PH Bicsa Financial Center","EDEMET","BICSA"]
["AG785","Generadora del Istmo, S. A.","PH Capital Plaza Business Center","ENSA","CPBCEN31"]
["AG558","Generadora del Istmo, S. A.","PH Evolution Tower Corp","EDEMET","EVOLTOW"]
["AG814","Generadora del Istmo, S. A.","PH Plaza Credicorp Bank Panamá","EDEMET","CREDIBANK"]
["AG787","Generadora del Istmo, S. A.","PH The Point/Miradores At The Point","EDEMET","THEPOINT"]
["AG556","Generadora del Istmo, S. A.","PH Torre Panama","ENSA","TORREPMA"]
["AG813","Generadora del Istmo, S. A.","PH Torres de Las Américas","EDEMET","TAMERICAS"]
["AG217","Generadora del Istmo, S. A.","Planta Jugos del Prado","ENSA","JPRADO"]
["AG786","Generadora del Istmo, S. A.","Proserv, S.A.","ENSA","PROSERV97"]
["AG387","Generadora del Istmo, S. A.","Reflections Intertrade Corp.","EDEMET","HHINNEX67"]
["AG948","Generadora del Istmo, S. A.","Royal Casino","EDEMET","GCP0694"]
["AG909","Generadora del Istmo, S. A.","Suez International SAS","ENSA","GCP0663"]
["AG218","Generadora del Istmo, S. A.","Taller de Mecánica y Depósitos","ENSA","TMECDEP"]
["AG397","Hidro Boquerón, S. A.","Inversiones Meregilda, S.A.","ENSA","INVMEREG"]
["AG382","Hidro Boquerón, S. A.","La Coruña Investment, S.A.","ENSA","CORUNA13"]
["AG123","Hidro Ibérica, S. A,","Productos Maribel, S.A.","EDEMET","PROCARSA"]
["AG931","Hidroecológica del Teribe, S. A.","Corporación Nacional de Envases, S.A.","ENSA","GCP0678"]
["AG248","Hidroecológica del Teribe, S. A.","Edificio ENSA Cerro Viento","ENSA","ENSACV"]
["AG157","Hidroecológica del Teribe, S. A.","Santa María Business District","ENSA","SMARIABD"]
["AG619","Hidroeléctrica San Lorenzo, S.A.","PTP Estación de Bombeo Charco Azul","EDECHI","PTPCAZUL"]
["AG930","Hidropiedra, S. A.","Retail Centenario","ENSA","GCP0677"]
["AG385","Hydro Caisan, S. A.","Club Unión, S.A.","EDEMET","CUNION20"]
["AG177","Hydro Caisan, S. A.","La Prensa, S.A.","EDEMET","LAPRENSA"]
["AG723","Ideal Panamá, S. A.","Avipac INC","ENSA","AVIPAC"]
["AG320","Ideal Panamá, S. A.","Avipac Inc. Vacamonte","EDEMET","AVIPACVAC"]
["AG917","Ideal Panamá, S. A.","Clínica Especializada de Azuero, S.A.","EDEMET","GCP0669"]
["AG249","Ideal Panamá, S. A.","Golden Lion Casino","ENSA","GLION"]
["AG835","Ideal Panamá, S. A.","Hotel La Compañía","EDEMET","GCP0614"]
["AG405","Ideal Panamá, S. A.","Promotora Las Américas Golden Tower, S.A.","EDEMET","PROMGTOWER"]
["AG336","Ideal Panamá, S. A.","Santa María Hotel & Golf, S. A.","ENSA","HSMARIA"]
["AG250","Ideal Panamá, S. A.","Sortis Hotel","EDEMET","SORTIS"]
["AG208","Ideal Panamá, S. A.","Tubotec, S.A.","ENSA","TUBOTEC"]
["AG881","Ideal Panamá, S. A.","Waymore Hotel, S. A.","EDEMET","GCP0645"]
["AG685","Las Perlas Sur, S. de R. L.","Hotel Hilton Garden Inn","EDEMET","METROHOTEL"]
["AG856","Las Perlas Sur, S. de R. L.","Jumbo Market (Cuatro Altos)","ENSA","GCP0629"]
["AG858","Las Perlas Sur, S. de R. L.","Sysco Autoservicio, S.A.","ENSA","GCP0631"]
["AG328","PAN-AM Generating Limited, S.A.","PH Parque del Mar I","ENSA","PMAR1"]
["AG296","Panasolar Generation, S.A.","Luna Brillante","EDEMET","LUNAB"]
["AG322","Panasolar Generation, S.A.","Majestic 507, Corp.","EDEMET","MAJESTIC"]
["AG271","Panasolar Generation, S.A.","Megapolis","EDEMET","MPOLIS"]
["AG774","Panasolar Generation, S.A.","PH Megapolis Outlets Panama","EDEMET","MCENTRO"]
["AG254","Panasolar Generation, S.A.","PH Oceanía Business Plaza Torre","EDEMET","OCEANIA"]
["AG295","Panasolar Generation, S.A.","PH Sortis Business Tower","EDEMET","SORTIS3"]
["AG698","PSZ1, S. A.","Casino Hotel La Hacienda (Santiago)","EDEMET","CAVAGAM"]
["AG611","PSZ1, S. A.","Colón Container Terminal 13","ENSA","CCONTAIN13"]
["AG612","PSZ1, S. A.","Colón Container Terminal 2","ENSA","CCONTAIN2"]
["AG699","PSZ1, S. A.","Conway Albrook","EDEMET","CONWAYAL"]
["AG700","PSZ1, S. A.","Conway Los Pueblos","ENSA","CONWAYLPB"]
["AG701","PSZ1, S. A.","Conway Multicentro","EDEMET","CONWAYMC"]
["AG702","PSZ1, S. A.","Conway Westland","EDEMET","CONWAYWL"]
["AG599","PSZ1, S. A.","Farallón Aquaculture Vacamonte","EDEMET","FARACVAC"]
["AG582","PSZ1, S. A.","Glaxosmithkline Panamá","ENSA","GSK_JDIAZ"]
["AG607","PSZ1, S. A.","Tribunal Electoral","EDEMET","TELECTOR"]
["AG214","Tecnisol I, S.A.","Clínica Hospital San Fernando, S.A.","EDEMET","CHSF"]
["AG312","Tecnisol I, S.A.","Coca Cola Femsa, S.A","ENSA","PECCOLA63"]
["AG758","Tecnisol I, S.A.","Petrolera Nacional Antón","EDEMET","TERPELANT"]
["AG757","Tecnisol I, S.A.","Petrolera Nacional Autopista Colón","ENSA","TERPELCOL"]
["AG753","Tecnisol I, S.A.","Petrolera Nacional Chorrera","EDEMET","TERPELCHO"]
["AG754","Tecnisol I, S.A.","Petrolera Nacional Coronado","EDEMET","TERPELCOR"]
["AG755","Tecnisol I, S.A.","Petrolera Nacional Penonomé","EDEMET","TERPELPEN"]
["AG756","Tecnisol I, S.A.","Petrolera Nacional Santiago","EDEMET","TERPELSTG"]
["AG182","Tecnisol I, S.A.","Planta Embotelladora Coca Cola 01","ENSA","PECCOLA06"]
["AG181","Tecnisol I, S.A.","Planta Embotelladora Coca Cola 02","ENSA","PECCOLA51"]
["AG829","Tecnisol I, S.A.","Princess Hotel Panamá","EDEMET","GCP0608"]
["AG315","Tecnisol I, S.A.","Ventas y Mercadeo Panama, S.A.","ENSA","VMERCA"]
["AG673","Tecnisol II, S.A.","Cable Onda IDC Divisa","EDEMET","COIDCDIV"]
["AG131","Tecnisol II, S.A.","Cable Onda, S. A.","EDEMET","CABLEONDA"]
["AG178","Tecnisol II, S.A.","Cable Onda 12 de Octubre","ENSA","CONDA12OC"]
["AG190","Tecnisol II, S.A.","Hotel Torres de Alba","EDEMET","TORREALBA"]
["AG566","Tecnisol II, S.A.","Hotelera RH, S.A.","EDEMET","HPBLANCA"]
["AG210","Tecnisol II, S.A.","Macello, S. A.","ENSA","MACELLO"]
["AG290","Tecnisol II, S.A.","PH Multiplaza Pacific","EDEMET","MPLAZA"]
["AG916","Tecnisol II, S.A.","Telecomunicaciones Digitales, S.A. (Chorrera)","EDEMET","GCP0668"]
["AG681","Tecnisol II, S.A.","Telefónica Móviles Obarrio BOC ","EDEMET","TELEBOB"]
["AG871","Tecnisol II, S.A.","TowerBank International, Inc. (Calle 50)","EDEMET","GCP0640"]
["AG565","Tecnisol II, S.A.","Urban Developments, S.A.","EDEMET","HRIU"]
["AG265","Tecnisol III, S.A.","Delirys Bella Vista","EDEMET","DELYRBVTA"]
["AG340","Tecnisol III, S.A.","Ice Gaming Corporation","EDEMET","ICEGAMING"]
["AG865","Tecnisol III, S.A.","Súper Riba Smith Albrook","EDEMET","GCP0637"]
["AG306","Tecnisol III, S.A.","Súper Riba Smith Alta Plaza","ENSA","RSAPLAZA"]
["AG266","Tecnisol III, S.A.","Súper Riba Smith Bella Vista","EDEMET","RSBVISTA"]
["AG223","Tecnisol III, S.A.","Súper Riba Smith Brisas del Golf","ENSA","RSBGOLF"]
["AG263","Tecnisol III, S.A.","Súper Riba Smith Chitré","EDEMET","RSCHITRE"]
["AG262","Tecnisol III, S.A.","Súper Riba Smith Coronado","EDEMET","RSCORONA"]
["AG221","Tecnisol III, S.A.","Súper Riba Smith Costa del Este","ENSA","RSCESTE"]
["AG261","Tecnisol III, S.A.","Súper Riba Smith Howard Panamá Pacífico","EDEMET","RSHOWARD"]
["AG219","Tecnisol III, S.A.","Súper Riba Smith La Pita","EDEMET","RSPITA"]
["AG260","Tecnisol III, S.A.","Súper Riba Smith Multiplaza","EDEMET","RSMPLAZA"]
["AG264","Tecnisol III, S.A.","Súper Riba Smith Plaza Market","EDEMET","RSMARKET"]
["AG220","Tecnisol III, S.A.","Súper Riba Smith Transistmica","EDEMET","RSTRANS"]
["AG704","Tecnisol III, S.A.","Súper Riba Smith Versalles","ENSA","RSVERSAL"]
["AG321","Tecnisol III, S.A.","The Iron Tower, Corp.","EDEMET","IRONTOWER"]