{"text_format":"1","workbook":"xlsx","n_sheets":8,"sheets":["Portada","Energia","Potencia","Factor de carga","Demanda Interruptible","Importacion Contratada","DATOS","DATOS P"],"not_rendered":{"charts":0,"images":1,"macros":1,"external_links":0,"defined_names":4,"comments":0,"pivot_tables":0},"unopened":[],"bounds":{"document_bytes":16777216,"sheet_cells":100000,"rows_first":2000,"rows_last":500,"rows_between":2000,"halvings":0,"cell_chars":16384,"cell_head_chars":4096},"cells_cut":0,"cells_raw":0,"read":"whole","date_system":"1900"}

{"sheet":"Portada","index":0,"n_rows":12,"n_cols":6,"rows_kept":12,"cut":false,"hidden":false,"merged":[[1,14,1,18],[2,14,2,18],[20,3,20,7],[6,1,6,10],[7,1,7,10],[10,1,10,2],[11,1,11,2]]}
[]
[]
[]
[]
[]
[]
[null,"DATOS PARA EL INFORME INDICATIVO DE DEMANDA"]
[null,"PROYECCIONES  - DATOS"]
[]
[]
[null,"RESPONSABLE:"]
[null,"PERIODO:",null,2026,"   ---",{"$f":"+D12+20","v":2046}]

{"sheet":"Energia","index":1,"n_rows":258,"n_cols":2,"rows_kept":258,"cut":false,"hidden":true,"merged":[[3,0,3,1],[2,0,2,1],[1,0,1,1],[0,0,0,1]]}
["REPRESENTANTE"]
["GRAN CLIENTE"]
["DISTRIBUIDOR"]
["CODIGO"]
[]
["AÑO","MES"]
[{"$f":"+Portada!D12","v":2026},1]
[{"$f":"+IF(B8=1,A7+1,A7)","v":2026},{"$f":"+IF(B7=12,1,B7+1)","v":2}]
[{"$f":"+IF(B9=1,A8+1,A8)","v":2026},{"$f":"+IF(B8=12,1,B8+1)","v":3}]
[2026,4]
[2026,5]
[2026,6]
[2026,7]
[2026,8]
[2026,9]
[2026,10]
[2026,11]
[2026,12]
[2027,1]
[2027,2]
[2027,3]
[2027,4]
[2027,5]
[2027,6]
[2027,7]
[2027,8]
[2027,9]
[2027,10]
[2027,11]
[2027,12]
[2028,1]
[2028,2]
[2028,3]
[2028,4]
[2028,5]
[2028,6]
[2028,7]
[2028,8]
[2028,9]
[2028,10]
{"$rows_left_out":219}
{"sheet":"Potencia","index":2,"n_rows":258,"n_cols":2,"rows_kept":258,"cut":false,"hidden":true,"merged":[[3,0,3,1],[0,0,0,1],[1,0,1,1],[2,0,2,1]]}
["REPRESENTANTE"]
["GRAN CLIENTE"]
["DISTRIBUIDOR"]
["CODIGO"]
[]
["AÑO","MES"]
[{"$f":"+Portada!D12","v":2026},1]
[{"$f":"+IF(B8=1,A7+1,A7)","v":2026},{"$f":"+IF(B7=12,1,B7+1)","v":2}]
[{"$f":"+IF(B9=1,A8+1,A8)","v":2026},{"$f":"+IF(B8=12,1,B8+1)","v":3}]
[2026,4]
[2026,5]
[2026,6]
[2026,7]
[2026,8]
[2026,9]
[2026,10]
[2026,11]
[2026,12]
[2027,1]
[2027,2]
[2027,3]
[2027,4]
[2027,5]
[2027,6]
[2027,7]
[2027,8]
[2027,9]
[2027,10]
[2027,11]
[2027,12]
[2028,1]
[2028,2]
[2028,3]
[2028,4]
[2028,5]
[2028,6]
[2028,7]
[2028,8]
[2028,9]
[2028,10]
{"$rows_left_out":219}
{"sheet":"Factor de carga","index":3,"n_rows":258,"n_cols":2,"rows_kept":258,"cut":false,"hidden":true,"merged":[[3,0,3,1],[0,0,0,1],[1,0,1,1],[2,0,2,1]]}
["REPRESENTANTE"]
["GRAN CLIENTE"]
["DISTRIBUIDOR"]
["CODIGO"]
[]
["AÑO","MES"]
[{"$f":"+Portada!D12","v":2026},1]
[{"$f":"+IF(B8=1,A7+1,A7)","v":2026},{"$f":"+IF(B7=12,1,B7+1)","v":2}]
[{"$f":"+IF(B9=1,A8+1,A8)","v":2026},{"$f":"+IF(B8=12,1,B8+1)","v":3}]
[2026,4]
[2026,5]
[2026,6]
[2026,7]
[2026,8]
[2026,9]
[2026,10]
[2026,11]
[2026,12]
[2027,1]
[2027,2]
[2027,3]
[2027,4]
[2027,5]
[2027,6]
[2027,7]
[2027,8]
[2027,9]
[2027,10]
[2027,11]
[2027,12]
[2028,1]
[2028,2]
[2028,3]
[2028,4]
[2028,5]
[2028,6]
[2028,7]
[2028,8]
[2028,9]
[2028,10]
{"$rows_left_out":219}
{"sheet":"Demanda Interruptible","index":4,"n_rows":258,"n_cols":2,"rows_kept":258,"cut":false,"hidden":true,"merged":[[3,0,3,1],[0,0,0,1],[1,0,1,1],[2,0,2,1]]}
["REPRESENTANTE"]
["GRAN CLIENTE"]
["DISTRIBUIDOR"]
["CODIGO"]
[]
["AÑO","MES"]
[{"$f":"+Portada!D12","v":2026},1]
[{"$f":"+IF(B8=1,A7+1,A7)","v":2026},{"$f":"+IF(B7=12,1,B7+1)","v":2}]
[{"$f":"+IF(B9=1,A8+1,A8)","v":2026},{"$f":"+IF(B8=12,1,B8+1)","v":3}]
[2026,4]
[2026,5]
[2026,6]
[2026,7]
[2026,8]
[2026,9]
[2026,10]
[2026,11]
[2026,12]
[2027,1]
[2027,2]
[2027,3]
[2027,4]
[2027,5]
[2027,6]
[2027,7]
[2027,8]
[2027,9]
[2027,10]
[2027,11]
[2027,12]
[2028,1]
[2028,2]
[2028,3]
[2028,4]
[2028,5]
[2028,6]
[2028,7]
[2028,8]
[2028,9]
[2028,10]
{"$rows_left_out":219}
{"sheet":"Importacion Contratada","index":5,"n_rows":258,"n_cols":2,"rows_kept":258,"cut":false,"hidden":true,"merged":[[3,0,3,1],[0,0,0,1],[1,0,1,1],[2,0,2,1]]}
["REPRESENTANTE"]
["GRAN CLIENTE"]
["DISTRIBUIDOR"]
["CODIGO"]
[]
["AÑO","MES"]
[{"$f":"+Portada!D12","v":2026},1]
[{"$f":"+IF(B8=1,A7+1,A7)","v":2026},{"$f":"+IF(B7=12,1,B7+1)","v":2}]
[{"$f":"+IF(B9=1,A8+1,A8)","v":2026},{"$f":"+IF(B8=12,1,B8+1)","v":3}]
[2026,4]
[2026,5]
[2026,6]
[2026,7]
[2026,8]
[2026,9]
[2026,10]
[2026,11]
[2026,12]
[2027,1]
[2027,2]
[2027,3]
[2027,4]
[2027,5]
[2027,6]
[2027,7]
[2027,8]
[2027,9]
[2027,10]
[2027,11]
[2027,12]
[2028,1]
[2028,2]
[2028,3]
[2028,4]
[2028,5]
[2028,6]
[2028,7]
[2028,8]
[2028,9]
[2028,10]
{"$rows_left_out":219}
{"sheet":"DATOS","index":6,"n_rows":1003,"n_cols":8,"rows_kept":1003,"cut":false,"hidden":true,"merged":[]}
["ID_AGENTE","RESPONSABLE","NOMBRE_AGENTE","CONSECION","CODIGO",null,"ID","RESPONSABLES"]
["AG771","ACTIVO","Five Star Management, S. A.","EDEMET","FIVESTAR",null,{"$f":"IF(H2=\"\",\"\",MAX(G$1:G1)+1)","v":1},{"$f":"IFERROR(INDEX(DATOS!$B$2:$B$1003, MATCH(0, INDEX(COUNTIF($H$1:H1, DATOS!$B$2:$B$1003), 0, 0), 0)), \"\")","v":"ACTIVO"}]
["AG256","GRAN CLIENTE ACTIVO","Arce Avícola, S.A. (OLD)","ENSA","ARCEAV",null,{"$f":"IF(H3=\"\",\"\",MAX(G$1:G2)+1)","v":2},{"$f":"IFERROR(INDEX(DATOS!$B$2:$B$1003, MATCH(0, INDEX(COUNTIF($H$1:H2, DATOS!$B$2:$B$1003), 0, 0), 0)), \"\")","v":"GRAN CLIENTE ACTIVO"}]
["AG183","GRAN CLIENTE ACTIVO","Empaques de Colón, S.A.","ENSA","ECSA",null,{"$f":"IF(H4=\"\",\"\",MAX(G$1:G3)+1)","v":3},{"$f":"IFERROR(INDEX(DATOS!$B$2:$B$1003, MATCH(0, INDEX(COUNTIF($H$1:H3, DATOS!$B$2:$B$1003), 0, 0), 0)), \"\")","v":"DISTRIBUIDORES Y AUTOGENERADORES"}]
["AG887","GRAN CLIENTE ACTIVO","Minera Panamá, S. A. (Gran Cliente)",null,"MINPMAGCA",null,{"$f":"IF(H5=\"\",\"\",MAX(G$1:G4)+1)","v":4},{"$f":"IFERROR(INDEX(DATOS!$B$2:$B$1003, MATCH(0, INDEX(COUNTIF($H$1:H4, DATOS!$B$2:$B$1003), 0, 0), 0)), \"\")","v":"AES Panamá, S.R.L."}]
["AG287","GRAN CLIENTE ACTIVO","Autoridad del Canal de Panamá - Planta Potabilizadora Mendoza - Activo","EDEMET","POTMEN",null,{"$f":"IF(H6=\"\",\"\",MAX(G$1:G5)+1)","v":5},{"$f":"IFERROR(INDEX(DATOS!$B$2:$B$1003, MATCH(0, INDEX(COUNTIF($H$1:H5, DATOS!$B$2:$B$1003), 0, 0), 0)), \"\")","v":"Alternegy, S.A."}]
["AG423","GRAN CLIENTE ACTIVO","Panadería Santa Librada – ACTIVO","EDEMET","P_SLIBRADA",null,{"$f":"IF(H7=\"\",\"\",MAX(G$1:G6)+1)","v":6},{"$f":"IFERROR(INDEX(DATOS!$B$2:$B$1003, MATCH(0, INDEX(COUNTIF($H$1:H6, DATOS!$B$2:$B$1003), 0, 0), 0)), \"\")","v":"Argentum Solar, S.A."}]
["AG705","GRAN CLIENTE ACTIVO","Súper Carnes Aguadulce - Importadora Virzi, S.A. (Old)","EDEMET","SCARAG_ACTIVO",null,{"$f":"IF(H8=\"\",\"\",MAX(G$1:G7)+1)","v":7},{"$f":"IFERROR(INDEX(DATOS!$B$2:$B$1003, MATCH(0, INDEX(COUNTIF($H$1:H7, DATOS!$B$2:$B$1003), 0, 0), 0)), \"\")","v":"Autoridad del Canal de Panamá Generador"}]
["AG706","GRAN CLIENTE ACTIVO","Súper Carnes Palermo - Importadora Virzi, S.A. (Old)","EDEMET","SCARPALE_ACTIVO",null,{"$f":"IF(H9=\"\",\"\",MAX(G$1:G8)+1)","v":8},{"$f":"IFERROR(INDEX(DATOS!$B$2:$B$1003, MATCH(0, INDEX(COUNTIF($H$1:H8, DATOS!$B$2:$B$1003), 0, 0), 0)), \"\")","v":"Avanzalia Panamá, S.A."}]
["AG225","GRAN CLIENTE ACTIVO","Servicios de Carnes, S.A.","EDEMET","SERVICAR",null,{"$f":"IF(H10=\"\",\"\",MAX(G$1:G9)+1)","v":9},{"$f":"IFERROR(INDEX(DATOS!$B$2:$B$1003, MATCH(0, INDEX(COUNTIF($H$1:H9, DATOS!$B$2:$B$1003), 0, 0), 0)), \"\")","v":"Capira Solar, S.A."}]
["AG111","DISTRIBUIDORES Y AUTOGENERADORES","Azucarera Nacional, S. A.",null,"ANSA",null,{"$f":"IF(H11=\"\",\"\",MAX(G$1:G10)+1)","v":10},{"$f":"IFERROR(INDEX(DATOS!$B$2:$B$1003, MATCH(0, INDEX(COUNTIF($H$1:H10, DATOS!$B$2:$B$1003), 0, 0), 0)), \"\")","v":"Celsia Centroamérica, S. A."}]
["AG002","DISTRIBUIDORES Y AUTOGENERADORES","Autoridad del Canal de Panamá",null,"ACP",null,{"$f":"IF(H12=\"\",\"\",MAX(G$1:G11)+1)","v":11},{"$f":"IFERROR(INDEX(DATOS!$B$2:$B$1003, MATCH(0, INDEX(COUNTIF($H$1:H11, DATOS!$B$2:$B$1003), 0, 0), 0)), \"\")","v":"Daconan Solar, S.A"}]
["AG640","DISTRIBUIDORES Y AUTOGENERADORES","Central Azucarero de Alanje, S. A.",null,"CADASA",null,{"$f":"IF(H13=\"\",\"\",MAX(G$1:G12)+1)","v":12},{"$f":"IFERROR(INDEX(DATOS!$B$2:$B$1003, MATCH(0, INDEX(COUNTIF($H$1:H12, DATOS!$B$2:$B$1003), 0, 0), 0)), \"\")","v":"Electron Investment, S. A."}]
["AG015","DISTRIBUIDORES Y AUTOGENERADORES","Empresa de Distribución Eléctrica Chiriquí, S. A.",null,"EDECHI",null,{"$f":"IF(H14=\"\",\"\",MAX(G$1:G13)+1)","v":13},{"$f":"IFERROR(INDEX(DATOS!$B$2:$B$1003, MATCH(0, INDEX(COUNTIF($H$1:H13, DATOS!$B$2:$B$1003), 0, 0), 0)), \"\")","v":"Enel Fortuna"}]
["AG014","DISTRIBUIDORES Y AUTOGENERADORES","Empresa de Distribución Eléctrica Metro Oeste, S. A.",null,"EDEMET",null,{"$f":"IF(H15=\"\",\"\",MAX(G$1:G14)+1)","v":14},{"$f":"IFERROR(INDEX(DATOS!$B$2:$B$1003, MATCH(0, INDEX(COUNTIF($H$1:H14, DATOS!$B$2:$B$1003), 0, 0), 0)), \"\")","v":"Enel Renovable, S.R.L"}]
["AG013","DISTRIBUIDORES Y AUTOGENERADORES","Empresa de Distribución Eléctrica Elektra Noreste, S. A.",null,"ENSA",null,{"$f":"IF(H16=\"\",\"\",MAX(G$1:G15)+1)","v":15},{"$f":"IFERROR(INDEX(DATOS!$B$2:$B$1003, MATCH(0, INDEX(COUNTIF($H$1:H15, DATOS!$B$2:$B$1003), 0, 0), 0)), \"\")","v":"Generación Solar, S. A."}]
["AG164","DISTRIBUIDORES Y AUTOGENERADORES","Minera Panamá, S.A.",null,"MINERAPMA",null,{"$f":"IF(H17=\"\",\"\",MAX(G$1:G16)+1)","v":16},{"$f":"IFERROR(INDEX(DATOS!$B$2:$B$1003, MATCH(0, INDEX(COUNTIF($H$1:H16, DATOS!$B$2:$B$1003), 0, 0), 0)), \"\")","v":"Generadora del Istmo, S. A."}]
["AG155","AES Panamá, S.R.L.","Aceti-Oxígeno, S.A.","EDEMET","ACETIOX",null,{"$f":"IF(H18=\"\",\"\",MAX(G$1:G17)+1)","v":17},{"$f":"IFERROR(INDEX(DATOS!$B$2:$B$1003, MATCH(0, INDEX(COUNTIF($H$1:H17, DATOS!$B$2:$B$1003), 0, 0), 0)), \"\")","v":"Hidro Boquerón, S. A."}]
["AG513","AES Panamá, S.R.L.","Agroindustrial CEDI y Carnes (Curundú)","EDEMET","AGCEDICAR",null,{"$f":"IF(H19=\"\",\"\",MAX(G$1:G18)+1)","v":18},{"$f":"IFERROR(INDEX(DATOS!$B$2:$B$1003, MATCH(0, INDEX(COUNTIF($H$1:H18, DATOS!$B$2:$B$1003), 0, 0), 0)), \"\")","v":"Hidro Ibérica, S. A,"}]
["AG585","AES Panamá, S.R.L.","Assa Calle 50","EDEMET","ASSAC50",null,{"$f":"IF(H20=\"\",\"\",MAX(G$1:G19)+1)","v":19},{"$f":"IFERROR(INDEX(DATOS!$B$2:$B$1003, MATCH(0, INDEX(COUNTIF($H$1:H19, DATOS!$B$2:$B$1003), 0, 0), 0)), \"\")","v":"Hidroecológica del Teribe, S. A."}]
["AG458","AES Panamá, S.R.L.","Banco General Centro Operativo","ENSA","BGRALCO64",null,{"$f":"IF(H21=\"\",\"\",MAX(G$1:G20)+1)","v":20},{"$f":"IFERROR(INDEX(DATOS!$B$2:$B$1003, MATCH(0, INDEX(COUNTIF($H$1:H20, DATOS!$B$2:$B$1003), 0, 0), 0)), \"\")","v":"Hidroeléctrica San Lorenzo, S.A."}]
["AG537","AES Panamá, S.R.L.","Banistmo Plaza Edison","EDEMET","BIPEDISON",null,{"$f":"IF(H22=\"\",\"\",MAX(G$1:G21)+1)","v":21},{"$f":"IFERROR(INDEX(DATOS!$B$2:$B$1003, MATCH(0, INDEX(COUNTIF($H$1:H21, DATOS!$B$2:$B$1003), 0, 0), 0)), \"\")","v":"Hidropiedra, S. A."}]
["AG767","AES Panamá, S.R.L.","Bimbo de Panamá, S.A.","EDEMET","BIMBO",null,{"$f":"IF(H23=\"\",\"\",MAX(G$1:G22)+1)","v":22},{"$f":"IFERROR(INDEX(DATOS!$B$2:$B$1003, MATCH(0, INDEX(COUNTIF($H$1:H22, DATOS!$B$2:$B$1003), 0, 0), 0)), \"\")","v":"Hydro Caisan, S. A."}]
["AG855","AES Panamá, S.R.L.","Biomuseo","EDEMET","GCP0628",null,{"$f":"IF(H24=\"\",\"\",MAX(G$1:G23)+1)","v":23},{"$f":"IFERROR(INDEX(DATOS!$B$2:$B$1003, MATCH(0, INDEX(COUNTIF($H$1:H23, DATOS!$B$2:$B$1003), 0, 0), 0)), \"\")","v":"Ideal Panamá, S. A."}]
["AG042","AES Panamá, S.R.L.","Cemento Bayano","ENSA","CEMEX",null,{"$f":"IF(H25=\"\",\"\",MAX(G$1:G24)+1)","v":24},{"$f":"IFERROR(INDEX(DATOS!$B$2:$B$1003, MATCH(0, INDEX(COUNTIF($H$1:H24, DATOS!$B$2:$B$1003), 0, 0), 0)), \"\")","v":"Las Perlas Sur, S. de R. L."}]
["AG507","AES Panamá, S.R.L.","Cemento Bayano Juan Díaz","ENSA","CEMEXJDIAZ",null,{"$f":"IF(H26=\"\",\"\",MAX(G$1:G25)+1)","v":25},{"$f":"IFERROR(INDEX(DATOS!$B$2:$B$1003, MATCH(0, INDEX(COUNTIF($H$1:H25, DATOS!$B$2:$B$1003), 0, 0), 0)), \"\")","v":"PAN-AM Generating Limited, S.A."}]
["AG095","AES Panamá, S.R.L.","Cemento Interoceánico (Industrias Básicas, S. A.)","EDEMET","CEMINTER",null,{"$f":"IF(H27=\"\",\"\",MAX(G$1:G26)+1)","v":26},{"$f":"IFERROR(INDEX(DATOS!$B$2:$B$1003, MATCH(0, INDEX(COUNTIF($H$1:H26, DATOS!$B$2:$B$1003), 0, 0), 0)), \"\")","v":"Panasolar Generation, S.A."}]
["AG827","AES Panamá, S.R.L.","Cervecería Barú","ENSA","GCP0606",null,{"$f":"IF(H28=\"\",\"\",MAX(G$1:G27)+1)","v":27},{"$f":"IFERROR(INDEX(DATOS!$B$2:$B$1003, MATCH(0, INDEX(COUNTIF($H$1:H27, DATOS!$B$2:$B$1003), 0, 0), 0)), \"\")","v":"PSZ1, S. A."}]
["AG138","AES Panamá, S.R.L.","Cervecería Nacional","EDEMET","CNAL",null,{"$f":"IF(H29=\"\",\"\",MAX(G$1:G28)+1)","v":28},{"$f":"IFERROR(INDEX(DATOS!$B$2:$B$1003, MATCH(0, INDEX(COUNTIF($H$1:H28, DATOS!$B$2:$B$1003), 0, 0), 0)), \"\")","v":"Tecnisol I, S.A."}]
["AG088","AES Panamá, S.R.L.","Contraloría General","EDEMET","CONTRAL",null,{"$f":"IF(H30=\"\",\"\",MAX(G$1:G29)+1)","v":29},{"$f":"IFERROR(INDEX(DATOS!$B$2:$B$1003, MATCH(0, INDEX(COUNTIF($H$1:H29, DATOS!$B$2:$B$1003), 0, 0), 0)), \"\")","v":"Tecnisol II, S.A."}]
["AG676","AES Panamá, S.R.L.","Copama Villa Lucre","ENSA","COPAVILU",null,{"$f":"IF(H31=\"\",\"\",MAX(G$1:G30)+1)","v":30},{"$f":"IFERROR(INDEX(DATOS!$B$2:$B$1003, MATCH(0, INDEX(COUNTIF($H$1:H30, DATOS!$B$2:$B$1003), 0, 0), 0)), \"\")","v":"Tecnisol III, S.A."}]
["AG684","AES Panamá, S.R.L.","Corporación Pio Pio  Oficina Llano Bonito","ENSA","MELOOFLBON",null,{"$f":"IF(H32=\"\",\"\",MAX(G$1:G31)+1)","v":31},{"$f":"IFERROR(INDEX(DATOS!$B$2:$B$1003, MATCH(0, INDEX(COUNTIF($H$1:H31, DATOS!$B$2:$B$1003), 0, 0), 0)), \"\")","v":0}]
["AG435","AES Panamá, S.R.L.","Costa del Este Town Center","ENSA","TOWNCENTER",null,{"$f":"IF(H33=\"\",\"\",MAX(G$1:G32)+1)","v":""},{"$f":"IFERROR(INDEX(DATOS!$B$2:$B$1003, MATCH(0, INDEX(COUNTIF($H$1:H32, DATOS!$B$2:$B$1003), 0, 0), 0)), \"\")","v":""}]
["AG173","AES Panamá, S.R.L.","Destilería San Isidro","EDEMET","VH_DES",null,{"$f":"IF(H34=\"\",\"\",MAX(G$1:G33)+1)","v":""},{"$f":"IFERROR(INDEX(DATOS!$B$2:$B$1003, MATCH(0, INDEX(COUNTIF($H$1:H33, DATOS!$B$2:$B$1003), 0, 0), 0)), \"\")","v":""}]
["AG252","AES Panamá, S.R.L.","Edificio Business Park","ENSA","BPARK",null,{"$f":"IF(H35=\"\",\"\",MAX(G$1:G34)+1)","v":""},{"$f":"IFERROR(INDEX(DATOS!$B$2:$B$1003, MATCH(0, INDEX(COUNTIF($H$1:H34, DATOS!$B$2:$B$1003), 0, 0), 0)), \"\")","v":""}]
["AG098","AES Panamá, S.R.L.","Embajada de los Estados Unidos de América","EDEMET","EEUA",null,{"$f":"IF(H36=\"\",\"\",MAX(G$1:G35)+1)","v":""},{"$f":"IFERROR(INDEX(DATOS!$B$2:$B$1003, MATCH(0, INDEX(COUNTIF($H$1:H35, DATOS!$B$2:$B$1003), 0, 0), 0)), \"\")","v":""}]
["AG567","AES Panamá, S.R.L.","Envases Universales Ball de Panamá, S.A.","ENSA","EUBP",null,{"$f":"IF(H37=\"\",\"\",MAX(G$1:G36)+1)","v":""},{"$f":"IFERROR(INDEX(DATOS!$B$2:$B$1003, MATCH(0, INDEX(COUNTIF($H$1:H36, DATOS!$B$2:$B$1003), 0, 0), 0)), \"\")","v":""}]
["AG631","AES Panamá, S.R.L.","Finca de Carriazo","ENSA","FCARRIAZO",null,{"$f":"IF(H38=\"\",\"\",MAX(G$1:G37)+1)","v":""},{"$f":"IFERROR(INDEX(DATOS!$B$2:$B$1003, MATCH(0, INDEX(COUNTIF($H$1:H37, DATOS!$B$2:$B$1003), 0, 0), 0)), \"\")","v":""}]
["AG485","AES Panamá, S.R.L.","Fundación para la Educación en la Televisión, S.A.","ENSA","FETV",null,{"$f":"IF(H39=\"\",\"\",MAX(G$1:G38)+1)","v":""},{"$f":"IFERROR(INDEX(DATOS!$B$2:$B$1003, MATCH(0, INDEX(COUNTIF($H$1:H38, DATOS!$B$2:$B$1003), 0, 0), 0)), \"\")","v":""}]
["AG713","AES Panamá, S.R.L.","Galores Refrigerados, S. A.","ENSA","GALORES",null,{"$f":"IF(H40=\"\",\"\",MAX(G$1:G39)+1)","v":""},{"$f":"IFERROR(INDEX(DATOS!$B$2:$B$1003, MATCH(0, INDEX(COUNTIF($H$1:H39, DATOS!$B$2:$B$1003), 0, 0), 0)), \"\")","v":""}]
{"$rows_left_out":964}
{"sheet":"DATOS P","index":7,"n_rows":559,"n_cols":5,"rows_kept":559,"cut":false,"hidden":true,"merged":[]}
["ID_AGENTE","RESPONSABLE","NOMBRE_AGENTE","CONSECION","CODIGO"]
["AG771","ACTIVO","Five Star Management, S. A.","EDEMET","FIVESTAR"]
["AG256","GRAN CLIENTE ACTIVO","Arce Avícola, S.A. (OLD)","ENSA","ARCEAV"]
["AG183","GRAN CLIENTE ACTIVO","Empaques de Colón, S.A.","ENSA","ECSA"]
["AG887","GRAN CLIENTE ACTIVO","Minera Panamá, S. A. (Gran Cliente)",null,"MINPMAGCA"]
["AG287","GRAN CLIENTE ACTIVO","Autoridad del Canal de Panamá - Planta Potabilizadora Mendoza - Activo","EDEMET","POTMEN"]
["AG423","GRAN CLIENTE ACTIVO","Panadería Santa Librada – ACTIVO","EDEMET","P_SLIBRADA"]
["AG705","GRAN CLIENTE ACTIVO","Súper Carnes Aguadulce - Importadora Virzi, S.A. (Old)","EDEMET","SCARAG_ACTIVO"]
["AG706","GRAN CLIENTE ACTIVO","Súper Carnes Palermo - Importadora Virzi, S.A. (Old)","EDEMET","SCARPALE_ACTIVO"]
["AG225","GRAN CLIENTE ACTIVO","Servicios de Carnes, S.A.","EDEMET","SERVICAR"]
["AG111","DISTRIBUIDORES Y AUTOGENERADORES","Azucarera Nacional, S. A.",null,"ANSA"]
["AG002","DISTRIBUIDORES Y AUTOGENERADORES","Autoridad del Canal de Panamá",null,"ACP"]
["AG640","DISTRIBUIDORES Y AUTOGENERADORES","Central Azucarero de Alanje, S. A.",null,"CADASA"]
["AG015","DISTRIBUIDORES Y AUTOGENERADORES","Empresa de Distribución Eléctrica Chiriquí, S. A.",null,"EDECHI"]
["AG014","DISTRIBUIDORES Y AUTOGENERADORES","Empresa de Distribución Eléctrica Metro Oeste, S. A.",null,"EDEMET"]
["AG013","DISTRIBUIDORES Y AUTOGENERADORES","Empresa de Distribución Eléctrica Elektra Noreste, S. A.",null,"ENSA"]
["AG164","DISTRIBUIDORES Y AUTOGENERADORES","Minera Panamá, S.A.",null,"MINERAPMA"]
["AG155","AES Panamá, S.R.L.","Aceti-Oxígeno, S.A.","EDEMET","ACETIOX"]
["AG513","AES Panamá, S.R.L.","Agroindustrial CEDI y Carnes (Curundú)","EDEMET","AGCEDICAR"]
["AG585","AES Panamá, S.R.L.","Assa Calle 50","EDEMET","ASSAC50"]
["AG458","AES Panamá, S.R.L.","Banco General Centro Operativo","ENSA","BGRALCO64"]
["AG537","AES Panamá, S.R.L.","Banistmo Plaza Edison","EDEMET","BIPEDISON"]
["AG767","AES Panamá, S.R.L.","Bimbo de Panamá, S.A.","EDEMET","BIMBO"]
["AG855","AES Panamá, S.R.L.","Biomuseo","EDEMET","GCP0628"]
["AG042","AES Panamá, S.R.L.","Cemento Bayano","ENSA","CEMEX"]
["AG507","AES Panamá, S.R.L.","Cemento Bayano Juan Díaz","ENSA","CEMEXJDIAZ"]
["AG095","AES Panamá, S.R.L.","Cemento Interoceánico (Industrias Básicas, S. A.)","EDEMET","CEMINTER"]
["AG827","AES Panamá, S.R.L.","Cervecería Barú","ENSA","GCP0606"]
["AG138","AES Panamá, S.R.L.","Cervecería Nacional","EDEMET","CNAL"]
["AG088","AES Panamá, S.R.L.","Contraloría General","EDEMET","CONTRAL"]
["AG676","AES Panamá, S.R.L.","Copama Villa Lucre","ENSA","COPAVILU"]
["AG684","AES Panamá, S.R.L.","Corporación Pio Pio  Oficina Llano Bonito","ENSA","MELOOFLBON"]
["AG435","AES Panamá, S.R.L.","Costa del Este Town Center","ENSA","TOWNCENTER"]
["AG173","AES Panamá, S.R.L.","Destilería San Isidro","EDEMET","VH_DES"]
["AG252","AES Panamá, S.R.L.","Edificio Business Park","ENSA","BPARK"]
["AG098","AES Panamá, S.R.L.","Embajada de los Estados Unidos de América","EDEMET","EEUA"]
["AG567","AES Panamá, S.R.L.","Envases Universales Ball de Panamá, S.A.","ENSA","EUBP"]
["AG631","AES Panamá, S.R.L.","Finca de Carriazo","ENSA","FCARRIAZO"]
["AG485","AES Panamá, S.R.L.","Fundación para la Educación en la Televisión, S.A.","ENSA","FETV"]
["AG713","AES Panamá, S.R.L.","Galores Refrigerados, S. A.","ENSA","GALORES"]
{"$rows_left_out":519}